1H-Phenalen-1-one,9-butoxy-

Gas phase ion energetics data

Data compiled by: Sharon G. Lias, Rhoda D. Levin, and Sherif A. Kafafi

Ionization energy determinations

IE (eV) Method Reference Comment
8.03 ± 0.04PECarnovale, Gan, et al., 1979Vertical value

References

Carnovale, Gan, et al., 1979
Carnovale, F.; Gan, T.H.; Peel, J.B.; Franz, K.-D., Photoelectron spectroscopic studies of some alkoxy phenalenones, Tetrahedron, 1979, 35, 129. [all data]