μ3-Ethylidyne-tris(μ2-hydro)triiron nonacarbonyl
- Formula: C11H6Fe3O9
- Molecular weight: 449.695
- CAS Registry Number: 69440-00-2

Gas phase ion energetics data

Data compiled as indicated in comments:
LBLHLM - Sharon G. Lias, John E. Bartmess, Joel F. Liebman, John L. Holmes, Rhoda D. Levin, and W. Gary Mallard
LLK - Sharon G. Lias, Rhoda D. Levin, and Sherif A. Kafafi
Ionization energy determinations
IE (eV) | Method | Reference | Comment |
---|---|---|---|
7.44 | PE | DeKock, Wong, et al., 1982 | LBLHLM |
7.5 | PE | Wong, Dutta, et al., 1981 | LLK |

References

DeKock, Wong, et al., 1982
DeKock, R.L.; Wong, K.S.; Fehlner, T.P.,
Effects of bridging hydrogens on metal-netal bonds. 2. UV photoelectron and UV-visible spectra and quantum chemical calculations for Fe3(μ-H)3(CO)9(μ3-CCH3) and Co3(CO)9(μ3-CCH3),
Inorg. Chem., 1982, 21, 3203. [all data]
Wong, Dutta, et al., 1981
Wong, K.S.; Dutta, T.L.; Fehlner, T.P.,
The proton as a probe of cluster bonding. The UV photoelectron spectra of two hydrido transition metal clusters,
J. Organomet. Chem., 1981, 215, 48. [all data]