1,2,3,6-Tetrahydropyridine
- Formula: C5H9N
- Molecular weight: 83.1317
- IUPAC Standard InChIKey: FTAHXMZRJCZXDL-UHFFFAOYSA-N
- CAS Registry Number: 694-05-3
- Chemical structure:
View 3d structure (requires JavaScript / HTML 5) - Other names: Pyridine, 1,2,3,6-tetrahydro-; δ3-Piperidine; 1,2,5,6-Tetrahydropyridine; UN 2410; Pyridine, 1,2,5,6-tetrahydro-

Gas phase thermochemistry data

Quantity | Value | Units | Method | Reference | Comment |
---|---|---|---|---|---|
ΔfH°gas | 30. | kJ/mol | Semi | Stewart, 2004 |

Condensed phase thermochemistry data

Data compiled by: Hussein Y. Afeefy, Joel F. Liebman, and Stephen E. Stein
Quantity | Value | Units | Method | Reference | Comment |
---|---|---|---|---|---|
ΔfH°liquid | 33. ± 2.3 | kJ/mol | Ccb | Bedford, Beezer, et al., 1963 | |
Quantity | Value | Units | Method | Reference | Comment |
ΔcH°liquid | -3287.3 ± 2.3 | kJ/mol | Ccb | Bedford, Beezer, et al., 1963 |

Phase change data

Data compiled as indicated in comments:
BS - Robert L. Brown and Stephen E. Stein
DRB - Donald R. Burgess, Jr.
Quantity | Value | Units | Method | Reference | Comment |
---|---|---|---|---|---|
Tboil | 381.2 | K | N/A | Aldrich Chemical Company Inc., 1990 | BS |
Quantity | Value | Units | Method | Reference | Comment |
ΔvapH° | 107.7 | kJ/mol | N/A | Bedford, Beezer, et al., 1963 | DRB |

Gas phase ion energetics data

Data compiled as indicated in comments:
LLK - Sharon G. Lias, Rhoda D. Levin, and Sherif A. Kafafi
Ionization energy determinations
IE (eV) | Method | Reference | Comment |
---|---|---|---|
8.0 | PE | Morishima, Yoshikawa, et al., 1975 | LLK |
8.64 ± 0.05 | PE | Morishima, Yoshikawa, et al., 1975 | Vertical value; LLK |

References

Stewart, 2004
Stewart, J.J.P.,
Comparison of the accuracy of semiempirical and some DFT methods for predicting heats of formation,
J. Mol. Model, 2004, 10, 1, 6-10, https://doi.org/10.1007/s00894-003-0157-6
. [all data]
Bedford, Beezer, et al., 1963
Bedford, A.F.; Beezer, A.E.; Mortimer, C.T.,
Heats of formation and bond energies. Part X. 1,2,5,6-tetrahydropyridine, piperidine, and piperazine,
J. Chem. Soc., 1963, 2039-2043. [all data]
Aldrich Chemical Company Inc., 1990
Aldrich Chemical Company Inc.,
Catalog Handbook of Fine Chemicals, Aldrich Chemical Company, Inc., Milwaukee WI, 1990, 1. [all data]
Morishima, Yoshikawa, et al., 1975
Morishima, I.; Yoshikawa, K.; Hashimoto, M.; Bekki, K.,
Homoallylic interaction between the nitrogen lone pair and the nonadjacent π bond in cyclic and bicyclic amines. I. Photoelectron spectroscopic study,
J. Am. Chem. Soc., 1975, 97, 4283. [all data]