1H-Imidazole, 2-methyl-
- Formula: C4H6N2
- Molecular weight: 82.1038
- IUPAC Standard InChIKey: LXBGSDVWAMZHDD-UHFFFAOYSA-N
- CAS Registry Number: 693-98-1
- Chemical structure:
View 3d structure (requires JavaScript / HTML 5) - Other names: Imidazole, 2-methyl-; 2-Methylimidazole; 2-Methyl-1H-imidazole; 2-Methyl glyoxaline; 2MZ

Gas phase thermochemistry data

Data compiled by: Hussein Y. Afeefy, Joel F. Liebman, and Stephen E. Stein
Quantity | Value | Units | Method | Reference | Comment |
---|---|---|---|---|---|
ΔfH°gas | 89.8 ± 1.1 | kJ/mol | Ccb | Jimenez, Roux, et al., 1992 |

Condensed phase thermochemistry data

Data compiled as indicated in comments:
ALS - Hussein Y. Afeefy, Joel F. Liebman, and Stephen E. Stein
DH - Eugene S. Domalski and Elizabeth D. Hearing
Quantity | Value | Units | Method | Reference | Comment |
---|---|---|---|---|---|
ΔfH°solid | 1.4 ± 0.8 | kJ/mol | Ccb | Jimenez, Roux, et al., 1992 | ALS |
Quantity | Value | Units | Method | Reference | Comment |
ΔcH°solid | -2432.9 ± 0.6 | kJ/mol | Ccb | Jimenez, Roux, et al., 1992 | ALS |
Constant pressure heat capacity of solid
Cp,solid (J/mol*K) | Temperature (K) | Reference | Comment |
---|---|---|---|
105.09 | 298.15 | Jimenez, Roux, et al., 1992 | DH |

Phase change data

Data compiled as indicated in comments:
BS - Robert L. Brown and Stephen E. Stein
ALS - Hussein Y. Afeefy, Joel F. Liebman, and Stephen E. Stein
DRB - Donald R. Burgess, Jr.
AC - William E. Acree, Jr., James S. Chickos
Quantity | Value | Units | Method | Reference | Comment |
---|---|---|---|---|---|
Tboil | 540.2 | K | N/A | Weast and Grasselli, 1989 | BS |
Quantity | Value | Units | Method | Reference | Comment |
ΔsubH° | 88.4 ± 0.7 | kJ/mol | V | Jimenez, Roux, et al., 1992 | ALS |
ΔsubH° | 88.4 | kJ/mol | N/A | Jimenez, Roux, et al., 1992 | DRB |
Enthalpy of sublimation
ΔsubH (kJ/mol) | Temperature (K) | Method | Reference | Comment |
---|---|---|---|---|
88.2 ± 0.7 | 309. | ME | Jimenez, Roux, et al., 1992 | Based on data from 301. to 318. K.; AC |

Gas phase ion energetics data

Data evaluated as indicated in comments:
HL - Edward P. Hunter and Sharon G. Lias
Data compiled as indicated in comments:
LLK - Sharon G. Lias, Rhoda D. Levin, and Sherif A. Kafafi
Quantity | Value | Units | Method | Reference | Comment |
---|---|---|---|---|---|
Proton affinity (review) | 963.4 | kJ/mol | N/A | Hunter and Lias, 1998 | HL |
Quantity | Value | Units | Method | Reference | Comment |
Gas basicity | 929.6 | kJ/mol | N/A | Hunter and Lias, 1998 | HL |
Ionization energy determinations
IE (eV) | Method | Reference | Comment |
---|---|---|---|
8.50 | PE | Ramsey, 1979 | Vertical value; LLK |

Kovats' RI, non-polar column, isothermal

Column type | Active phase | Temperature (C) | I | Reference | Comment |
---|---|---|---|---|---|
Capillary | OV-101 | 110. | 1050. | Zhuravleva, 2000 | 50. m/0.3 mm/0.4 μm, He |
Capillary | OV-101 | 150. | 1050. | Golovnya, Zhuravleva, et al., 1992 | 30. m/0.30 mm/0.20 μm |

Normal alkane RI, polar column, temperature ramp

Column type | Active phase | I | Reference | Comment |
---|---|---|---|---|
Capillary | DB-Wax | 2146. | Wong and Bernhard, 1988 | He, 70. C @ 8. min, 2. K/min; Column length: 30. m; Column diameter: 0.25 mm; Tend: 160. C |

References

Jimenez, Roux, et al., 1992
Jimenez, P.; Roux, M.V.; Turrion, C.,
Thermochemical properties of N-heterocyclic compounds IV. Enthalpies of combustion, vapour pressures and enthalpies of sublimation, and enthalpies of formation of 2-methylimidazole and 2-ethylimidazole and 2-ethylimidazole,
J. Chem. Thermodyn., 1992, 24, 1145-1149. [all data]
Weast and Grasselli, 1989
CRC Handbook of Data on Organic Compounds, 2nd Editon, Weast,R.C and Grasselli, J.G., ed(s)., CRC Press, Inc., Boca Raton, FL, 1989, 1. [all data]
Hunter and Lias, 1998
Hunter, E.P.; Lias, S.G.,
Evaluated Gas Phase Basicities and Proton Affinities of Molecules: An Update,
J. Phys. Chem. Ref. Data, 1998, 27, 3, 413-656, https://doi.org/10.1063/1.556018
. [all data]
Ramsey, 1979
Ramsey, B.G.,
Substituent effects on imidazole basicity and photoelectron spectroscopy determined ionization energies,
J. Org. Chem., 1979, 44, 2093. [all data]
Sorrell and Borovik, 1987
Sorrell, T.N.; Borovik, A.S.,
J. Am. Chem. Soc., 1987, 109, 4255. [all data]
Zhuravleva, 2000
Zhuravleva, I.L.,
Evaluation of the polarity and boiling points of nitrogen-containing heterocyclic compounds by gas chromatography,
Russ. Chem. Bull. (Engl. Transl.), 2000, 49, 2, 325-328, https://doi.org/10.1007/BF02494682
. [all data]
Golovnya, Zhuravleva, et al., 1992
Golovnya, R.V.; Zhuravleva, I.L.; Sal'kova, M.A.,
Prediction of Retention Indexes of Alkylimadazoles Under Conditions of Capillary Gas Chromatography,
J. Anal. Chem. USSR (Engl. Transl.), 1992, 7, 932-937. [all data]
Wong and Bernhard, 1988
Wong, J.M.; Bernhard, R.A.,
Effect of nitrogen source on pyrazine formation,
J. Agric. Food Chem., 1988, 36, 1, 123-129, https://doi.org/10.1021/jf00079a032
. [all data]