2-Butanone, 3-methyl-3-nitroso-
- Formula: C5H9NO2
- Molecular weight: 115.1305
- IUPAC Standard InChIKey: BNYBZCCLCWZWEM-UHFFFAOYSA-N
- CAS Registry Number: 6931-05-1
- Chemical structure:
View 3d structure (requires JavaScript / HTML 5) - Permanent link for this species. Use this link for bookmarking this species for future reference.

Reaction thermochemistry data

Data compiled by: Hussein Y. Afeefy, Joel F. Liebman, and Stephen E. Stein
Individual Reactions
By formula: C10H18N2O2 = 2C5H9NO2
Quantity | Value | Units | Method | Reference | Comment |
---|---|---|---|---|---|
ΔrH° | 77.4 ± 0.8 | kJ/mol | Cm | Keussler and Luttke, 1959 | liquid phase; solvent: Benzene |

Gas phase ion energetics data

Data compiled by: Sharon G. Lias, Rhoda D. Levin, and Sherif A. Kafafi
Ionization energy determinations
IE (eV) | Method | Reference | Comment |
---|---|---|---|
8.5 ± 0.1 | PE | Egdell, Green, et al., 1975 | Vertical value |

References

Keussler and Luttke, 1959
Keussler, V.v.; Luttke, W.,
Spektroskopische Untersuchungen an Nitrosoverbindungen. 3. Mitteilung: Die Dissoziationsenergie der Nitrosodimeren,
Z. Elektrochem., 1959, 63, 614-623. [all data]
Egdell, Green, et al., 1975
Egdell, R.; Green, J.C.; Rao, C.N.R.; Gowenlock, B.G.; Pfab, J.,
He(I) photoelectron studies of C-nitroso compounds,
J. Chem. Soc. Faraday Trans. 2, 1975, 988. [all data]