Hex-3-en-1,5-diyne
- Formula: C6H4
- Molecular weight: 76.0960
- IUPAC Standard InChIKey: KIWAUQFHKHLABA-UHFFFAOYSA-N
- CAS Registry Number: 6929-94-8
- Chemical structure:
View 3d structure (requires JavaScript / HTML 5) - Stereoisomers:

Gas phase ion energetics data

Data compiled by: Henry M. Rosenstock, Keith Draxl, Bruce W. Steiner, and John T. Herron
Ionization energy determinations
IE (eV) | Method | Reference |
---|---|---|
9.6 ± 0.2 | EI | Grutzmacher and Lohmann, 1967 |

References

Grutzmacher and Lohmann, 1967
Grutzmacher, H.-F.; Lohmann, J.,
Massenspektrometrie instabiler organischer Molekule. I. Ionisations-potential und Bildungsenthalpie von Dehydrobenzol,
Ann. Chem., 1967, 705, 81. [all data]