3-Hexene, 2,5-dimethyl-, (E)-
- Formula: C8H16
- Molecular weight: 112.2126
- IUPAC Standard InChIKey: KNCMKWVOMRUHKZ-AATRIKPKSA-N
- CAS Registry Number: 692-70-6
- Chemical structure:
View 3d structure (requires JavaScript / HTML 5) - Stereoisomers:
- Other names: trans-Diisopropylethylene; (E)-2,5-Dimethyl-3-hexene; trans-2,5-Dimethyl-3-hexene; 2,5-Dimethyl-trans-3-hexene; (E)-(CH3)2CHCH=CHCH(CH3)2; (3E)-2,5-Dimethyl-3-hexene; (E)-2,5-Dimethylhex-3-ene

Gas phase thermochemistry data

Data compiled by: Donald R. Burgess, Jr.
Quantity | Value | Units | Method | Reference | Comment |
---|---|---|---|---|---|
ΔfH°gas | -119.5 | kJ/mol | N/A | Yates and McDonald, 1973 | Value computed using ΔfHliquid° value of -159.3±1.5 kj/mol from Yates and McDonald, 1973 and ΔvapH° value of 39.8 kj/mol from alkenes correlation. |

Condensed phase thermochemistry data

Data compiled by: Hussein Y. Afeefy, Joel F. Liebman, and Stephen E. Stein
Quantity | Value | Units | Method | Reference | Comment |
---|---|---|---|---|---|
ΔfH°liquid | -159.3 ± 1.5 | kJ/mol | Ccb | Yates and McDonald, 1973 | |
Quantity | Value | Units | Method | Reference | Comment |
ΔcH°liquid | -5275.5 ± 1.5 | kJ/mol | Ccb | Yates and McDonald, 1973 | Corresponding ΔfHºliquid = -159.2 kJ/mol (simple calculation by NIST; no Washburn corrections) |
ΔcH°liquid | -5265.56 ± 0.50 | kJ/mol | Ccb | Yates and McDonald, 1971 | Corresponding ΔfHºliquid = -169.2 kJ/mol (simple calculation by NIST; no Washburn corrections) |

Phase change data

Data compiled as indicated in comments:
TRC - Thermodynamics Research Center, NIST Boulder Laboratories, Chris Muzny director
AC - William E. Acree, Jr., James S. Chickos
Quantity | Value | Units | Method | Reference | Comment |
---|---|---|---|---|---|
Tboil | 375.19 | K | N/A | Anonymous, 1954 | Uncertainty assigned by TRC = 0.2 K; TRC |
Tboil | 375.24 | K | N/A | Anonymous, 1953 | Uncertainty assigned by TRC = 0.3 K; TRC |
Quantity | Value | Units | Method | Reference | Comment |
Tfus | 177.920 | K | N/A | Streiff, Schultz, et al., 1957 | Uncertainty assigned by TRC = 0.04 K; TRC |
Tfus | 177.930 | K | N/A | Streiff, Schultz, et al., 1957 | Uncertainty assigned by TRC = 0.03 K; TRC |
Tfus | 177.950 | K | N/A | Streiff, Schultz, et al., 1957 | Uncertainty assigned by TRC = 0.02 K; TRC |
Quantity | Value | Units | Method | Reference | Comment |
ΔvapH° | 37.5 | kJ/mol | N/A | Reid, 1972 | AC |

Reaction thermochemistry data

Data compiled by: Hussein Y. Afeefy, Joel F. Liebman, and Stephen E. Stein
Individual Reactions
By formula: H2 + C8H16 = C8H18
Quantity | Value | Units | Method | Reference | Comment |
---|---|---|---|---|---|
ΔrH° | -112.2 ± 0.2 | kJ/mol | Chyd | Turner, Jarrett, et al., 1973 | liquid phase; solvent: Acetic acid |

Gas phase ion energetics data

Data compiled as indicated in comments:
LLK - Sharon G. Lias, Rhoda D. Levin, and Sherif A. Kafafi
Ionization energy determinations
IE (eV) | Method | Reference | Comment |
---|---|---|---|
8.838 ± 0.005 | PE | Masclet, Grosjean, et al., 1973 | LLK |

Kovats' RI, non-polar column, isothermal

Column type | Active phase | Temperature (C) | I | Reference | Comment |
---|---|---|---|---|---|
Capillary | Petrocol DH | 30. | 713.6 | Soják, Addová, et al., 2004 | 150. m/0.25 mm/1. μm, H2 |
Capillary | Squalane | 30. | 695.5 | Soják, Addová, et al., 2004 | He; Column length: 93. m; Column diameter: 0.25 mm |
Capillary | OV-101 | 40. | 704. | Laub and Purnell, 1988 | |
Capillary | OV-101 | 60. | 703. | Laub and Purnell, 1988 | |
Capillary | OV-101 | 80. | 703. | Laub and Purnell, 1988 | |
Capillary | OV-101 | 50. | 703.7 | Boneva and Dimov, 1986 | 100. m/0.27 mm/0.9 μm, N2 |
Capillary | OV-101 | 70. | 703.2 | Boneva and Dimov, 1986 | 100. m/0.27 mm/0.9 μm, N2 |
Capillary | Squalane | 50. | 695. | Boneva and Dimov, 1986 | N2; Column length: 100. m; Column diameter: 0.25 mm |
Capillary | Squalane | 70. | 694.5 | Boneva and Dimov, 1986 | N2; Column length: 100. m; Column diameter: 0.25 mm |
Capillary | Squalane | 50. | 695. | Chretien and Dubois, 1976 | |
Capillary | Squalane | 50. | 695. | Rijks and Cramers, 1974 | N2; Column length: 100. m; Column diameter: 0.25 mm |
Capillary | Squalane | 70. | 695. | Rijks and Cramers, 1974 | N2; Column length: 100. m; Column diameter: 0.25 mm |
Capillary | Squalane | 40. | 696. | Matukuma, 1969 | N2; Column length: 91.4 m; Column diameter: 0.25 mm |

Normal alkane RI, non-polar column, temperature ramp

Column type | Active phase | I | Reference | Comment |
---|---|---|---|---|
Capillary | Petrocol DH | 713. | Supelco, 2012 | 100. m/0.25 mm/0.50 μm, Helium, 20. C @ 15. min, 15. K/min, 220. C @ 30. min |

References

Yates and McDonald, 1973
Yates, K.; McDonald, R.S.,
Kinetics and mechanisms of electrophilic addition. II. A thermochemical-kinetic approach to transition-state structure,
J. Org. Chem., 1973, 38, 2465-2478. [all data]
Yates and McDonald, 1971
Yates, K.; McDonald, R.S.,
A thermochemical probe into the mechanism of electrophilic addition to olefins,
J. Am. Chem. Soc., 1971, 93, 6297-6299. [all data]
Anonymous, 1954
Anonymous, R.,
, Am. Pet. Inst. Res. Proj. 45, Tech. Rep. 13, Ohio State Univ., 1954. [all data]
Anonymous, 1953
Anonymous, R.,
, Physical Properties of Chemical Substances, Dow Chemical Company, 1953. [all data]
Streiff, Schultz, et al., 1957
Streiff, A.J.; Schultz, L.H.; Hulme, A.R.; Tucker, J.A.; Krouskop, N.C.; Rossini, F.D.,
Purification, Purity, and Freezing Points of 20 API Standard API Research Hydrocarbons,
Anal. Chem., 1957, 29, 361. [all data]
Reid, 1972
Reid, Robert C.,
Handbook on vapor pressure and heats of vaporization of hydrocarbons and related compounds, R. C. Wilhort and B. J. Zwolinski, Texas A Research Foundation. College Station, Texas(1971). 329 pages.$10.00,
AIChE J., 1972, 18, 6, 1278-1278, https://doi.org/10.1002/aic.690180637
. [all data]
Turner, Jarrett, et al., 1973
Turner, R.B.; Jarrett, A.D.; Goebel, P.; Mallon, B.J.,
Heats of hydrogenation. 9. Cyclic acetylenes and some miscellaneous olefins,
J. Am. Chem. Soc., 1973, 95, 790-792. [all data]
Masclet, Grosjean, et al., 1973
Masclet, P.; Grosjean, D.; Mouvier, G.,
Alkene ionization potentials. Part I. Quantitative determination of alkyl group structural effects,
J. Electron Spectrosc. Relat. Phenom., 1973, 2, 225. [all data]