Monocrotophos
- Formula: C7H14NO5P
- Molecular weight: 223.1635
- IUPAC Standard InChIKey: KRTSDMXIXPKRQR-AATRIKPKSA-N
- CAS Registry Number: 6923-22-4
- Chemical structure:
View 3d structure (requires JavaScript / HTML 5) - Stereoisomers:
- Other names: Azodrin; Phosphoric acid, dimethyl 1-methyl-3-(methylamino)-3-oxo-1-propenyl ester, (E)-; Phosphoric acid, dimethyl ester, ester with 3-hydroxy-N-methylcrotonamide, (E)-; C 1414; Des-N-Methyl dicrotophos; Nuvacron; Nuvacron-20; SD 9129; Phosphoric acid, dimethyl ester, ester with (E)-3-hydroxy-N-methylcrotonamide; Apadrin; Azodrin-71; Azodrin insecticide; Bilobran; Biloborn; Crisodrin; CIBA 1414; Crisodin; Crotonamide, 3-hydroxy-N-methyl-, dimethylphosphate, cis-; 3-(Dimethoxyphosphinyloxy)N-methyl-cis-crotonamide; (E)-Dimethyl 1-methyl-3-(methylamino)-3-oxo-1-propenyl phosphate; O,O-Dimethyl-O-(2-N-methylcarbamoyl-1-methyl-vinyl)-fosfaat; O,O-Dimethyl-O-(2-N-methylcarbamoyl-1-methyl)-vinyl-phosphat; O,O-Dimethyl-O-(2-N-methylcarbamoyl-1-methyl-vinyl) phosphate; O,O-Dimethyl-O-(1-methyl-2-N-methyl-carbamoyl)-vinyl-phosphat; Dimethyl 1-methyl-2-(methylcarbamoyl)vinyl phosphate, cis; Dimethyl phosphate ester with (E)-3-hydroxy-N-methylcrotonamide; Dimethyl phosphate ester of 3-hydroxy-N-methyl-cis-crotonamide; Dimethyl phosphate of 3-hydroxy-N-methyl-cis-crotonamide; O,O-Dimetil-O-(2-N-metilcarbamoil-1-metil-vinil)-fosfato; E-Monocrotophos; ENT 27,129; Glore phos 36; Hazodrin; 3-Hydroxy-N-methyl-cis-crotonamide dimethyl phosphate; Monokrotofosz; Monocil 40; Monocron; Monodrin; OMS 834; Phosphate de dimethyle et de 2-methylcarbamoyl 1-methyl vinyle; Phosphoric acid, dimethyl ester, ester with cis-3-hydroxy-N-methylcrotonamide; Plantdrin; Pillardrin; Shell sd 9129; Susvin; Ulvair; Phosphoric acid, dimethyl (1E)-1-methyl-3-(methylamino)-3-oxo-1-propenyl ester; Azodrin 202R; Corophos; Croton 36; Monocil; Monostar; Parryfos; Dimethyl (E)-1-methyl-2-methylcarbamoylvinyl phosphate

Phase change data

Data compiled as indicated in comments:
TRC - Thermodynamics Research Center, NIST Boulder Laboratories, Chris Muzny director
AC - William E. Acree, Jr., James S. Chickos
Quantity | Value | Units | Method | Reference | Comment |
---|---|---|---|---|---|
Tfus | 328.12 | K | N/A | Donnelly, Drewes, et al., 1990 | Uncertainty assigned by TRC = 0.2 K; TRC |
Tfus | 328.5 | K | N/A | Plato and Glasgow, 1969 | Uncertainty assigned by TRC = 0.1 K; TRC |
Enthalpy of fusion
ΔfusH (kJ/mol) | Temperature (K) | Method | Reference | Comment |
---|---|---|---|---|
22.36 | 326.9 | DSC | Donnelly, Drewes, et al., 1990, 2 | AC |

References

Donnelly, Drewes, et al., 1990
Donnelly, J.R.; Drewes, L.A.; Johnson, R.L.; Munslow, W.D.; Knapp, K.K.; Sovocool, G.W.,
Purity and heat of fusion data for environmental standards as determined by differential scanning calorimetry,
Thermochim. Acta, 1990, 167, 2, 155, https://doi.org/10.1016/0040-6031(90)80476-F
. [all data]
Plato and Glasgow, 1969
Plato, C.; Glasgow, A.R., Jr.,
Differential scanning calorimetry as a general method for determining the purity and heat of fusion of high-purity organic chemicals. Application to 95 compounds,
Anal. Chem., 1969, 41, 2, 330, https://doi.org/10.1021/ac60271a041
. [all data]
Donnelly, Drewes, et al., 1990, 2
Donnelly, J.R.; Drewes, L.A.; Johnson, R.L.; Munslow, W.D.; Knapp, K.K.; Sovocool, G.W.,
Purity and heat of fusion data for environmental standards as determined by differential scanning calorimetry,
Thermochimica Acta, 1990, 167, 2, 155-187, https://doi.org/10.1016/0040-6031(90)80476-F
. [all data]