1-Propyne, 3,3'-oxybis-
- Formula: C6H6O
- Molecular weight: 94.1112
- IUPAC Standard InChIKey: HRDCVMSNCBAMAM-UHFFFAOYSA-N
- CAS Registry Number: 6921-27-3
- Chemical structure:
View 3d structure (requires JavaScript / HTML 5) - Other names: Dipropargyl ether; 2-Propynyl ether; Dipropargyl oxide; Propargyl ether; (HC≡CCH2)2O; Di(2-propynyl) ether; Bis(2-propynyl) ether

Gas phase ion energetics data

Data evaluated as indicated in comments:
HL - Edward P. Hunter and Sharon G. Lias
Data compiled as indicated in comments:
LBLHLM - Sharon G. Lias, John E. Bartmess, Joel F. Liebman, John L. Holmes, Rhoda D. Levin, and W. Gary Mallard
Quantity | Value | Units | Method | Reference | Comment |
---|---|---|---|---|---|
Proton affinity (review) | 783.9 | kJ/mol | N/A | Hunter and Lias, 1998 | HL |
Quantity | Value | Units | Method | Reference | Comment |
Gas basicity | 756.5 | kJ/mol | N/A | Hunter and Lias, 1998 | HL |
Appearance energy determinations
Ion | AE (eV) | Other Products | Method | Reference | Comment |
---|---|---|---|---|---|
C3H3+ | 10.40 ± 0.05 | HCðCH2O | EI | Holmes and Lossing, 1984 | LBLHLM |

References

Hunter and Lias, 1998
Hunter, E.P.; Lias, S.G.,
Evaluated Gas Phase Basicities and Proton Affinities of Molecules: An Update,
J. Phys. Chem. Ref. Data, 1998, 27, 3, 413-656, https://doi.org/10.1063/1.556018
. [all data]
Holmes and Lossing, 1984
Holmes, J.L.; Lossing, F.P.,
Heats of formation of organic radicals from appearance energies,
Int. J. Mass Spectrom. Ion Processes, 1984, 58, 113. [all data]