Thiophene, 2,2'-dithiobis-
- Formula: C8H6S4
- Molecular weight: 230.393
- IUPAC Standard InChIKey: YOLFWWMPGNMXFI-UHFFFAOYSA-N
- CAS Registry Number: 6911-51-9
- Chemical structure:
View 3d structure (requires JavaScript / HTML 5) - Other names: Disulfide, 2-thienyl; 2-Thienyl disulfide; bis(2-Thienyl)disulfide; 2-(2-Thienyldisulfanyl)thiophene; bis(2-Thienyl) disulphide; 2-thiophen-2-yldisulfanylthiophene

Gas phase ion energetics data

Data compiled as indicated in comments:
LBLHLM - Sharon G. Lias, John E. Bartmess, Joel F. Liebman, John L. Holmes, Rhoda D. Levin, and W. Gary Mallard
Ionization energy determinations
IE (eV) | Method | Reference | Comment |
---|---|---|---|
7.5 | PE | Bock and Roth, 1983 | LBLHLM |
8.4 | PE | Bock and Roth, 1983 | Vertical value; LBLHLM |

References

Bock and Roth, 1983
Bock, H.; Roth, B.,
Radical ions. 49. Redox reactions of some thiophene derivatives,
Phosphorus Sulfur, 1983, 14, 211. [all data]
Popov, et al., 1963
Popov, E.M., et al.,
Zhur. Obshchei Khim., 1963, 33, 2261. [all data]