1-Buten-3-yne
- Formula: C4H4
- Molecular weight: 52.0746
- IUPAC Standard InChIKey: WFYPICNXBKQZGB-UHFFFAOYSA-N
- CAS Registry Number: 689-97-4
- Chemical structure:
View 3d structure (requires JavaScript / HTML 5) - Other names: But-1-en-3-yne; Butenyne; Ethene, ethynyl-; Monovinylacetylene; Vinylacetylene; 1-Butene-3-yne; 1-Butyn-3-ene; 3-Buten-1-yne; Buten-3-yne; Ethynylethene; 1-Butenyne; Vinylethyne

Gas phase thermochemistry data

Data compiled as indicated in comments:
ALS - Hussein Y. Afeefy, Joel F. Liebman, and Stephen E. Stein
GT - Glushko Thermocenter, Russian Academy of Sciences, Moscow
Quantity | Value | Units | Method | Reference | Comment |
---|---|---|---|---|---|
ΔfH°gas | 295. | kJ/mol | Chyd | Roth, Adamczak, et al., 1991 | ALS |
Constant pressure heat capacity of gas
Cp,gas (J/mol*K) | Temperature (K) | Reference | Comment |
---|---|---|---|
73.18 | 298.15 | Stamm R.F., 1949 | Estimations by difference method and Benson group additivity approach [ Dorofeeva O.V., 1997] show that statistically calculated value of S(298 K) can be overestimated by 5-7 J/mol*K and uncertainties of Cp(T) values can be equal to 4-7 J/mol*K.; GT |
73.51 | 300. | ||
88.95 | 400. | ||
101.46 | 500. | ||
111.59 | 600. | ||
120.00 | 700. | ||
127.19 | 800. | ||
133.34 | 900. | ||
138.74 | 1000. | ||
156.98 | 1100. |

Condensed phase thermochemistry data

Data compiled by: Hussein Y. Afeefy, Joel F. Liebman, and Stephen E. Stein
Quantity | Value | Units | Method | Reference | Comment |
---|---|---|---|---|---|
ΔcH°liquid | -2380. | kJ/mol | Ccb | Reppe, Schlichting, et al., 1948 | Corresponding ΔfHºliquid = 230. kJ/mol (simple calculation by NIST; no Washburn corrections) |

Phase change data

Data compiled as indicated in comments:
TRC - Thermodynamics Research Center, NIST Boulder Laboratories, Chris Muzny director
AC - William E. Acree, Jr., James S. Chickos
Quantity | Value | Units | Method | Reference | Comment |
---|---|---|---|---|---|
Tboil | 276.15 | K | N/A | Hennion, Price, et al., 1954 | Uncertainty assigned by TRC = 3. K; TRC |
Enthalpy of vaporization
ΔvapH (kJ/mol) | Temperature (K) | Method | Reference | Comment |
---|---|---|---|---|
26.0 | 236. | A | Stephenson and Malanowski, 1987 | Based on data from 180. to 278. K. See also Stull, 1947.; AC |
Antoine Equation Parameters
log10(P) = A − (B / (T + C))
P = vapor pressure (bar)
T = temperature (K)
View plot Requires a JavaScript / HTML 5 canvas capable browser.
Temperature (K) | A | B | C | Reference | Comment |
---|---|---|---|---|---|
180.0 to 278.4 | 4.04028 | 954.825 | -41.838 | Stull, 1947 | Coefficents calculated by NIST from author's data. |

Reaction thermochemistry data

Data compiled by: Hussein Y. Afeefy, Joel F. Liebman, and Stephen E. Stein
Individual Reactions
By formula: 2C2H2 = C4H4
Quantity | Value | Units | Method | Reference | Comment |
---|---|---|---|---|---|
ΔrH° | 233. | kJ/mol | Cm | Reppe, Schlichting, et al., 1948 | liquid phase |
ΔrH° | 208. | kJ/mol | Cm | Reppe, Schlichting, et al., 1948 | gas phase |
By formula: 3H2 + C4H4 = C4H10
Quantity | Value | Units | Method | Reference | Comment |
---|---|---|---|---|---|
ΔrH° | -422. ± 2. | kJ/mol | Chyd | Roth, Adamczak, et al., 1991 | liquid phase |

Henry's Law data

Data compiled by: Rolf Sander
Henry's Law constant (water solution)
kH(T) = k°H exp(d(ln(kH))/d(1/T) ((1/T) - 1/(298.15 K)))
k°H = Henry's law constant for solubility in water at 298.15 K (mol/(kg*bar))
d(ln(kH))/d(1/T) = Temperature dependence constant (K)
k°H (mol/(kg*bar)) | d(ln(kH))/d(1/T) (K) | Method | Reference |
---|---|---|---|
0.038 | 1700. | L | N/A |

Gas phase ion energetics data

Data evaluated as indicated in comments:
L - Sharon G. Lias
Data compiled as indicated in comments:
LLK - Sharon G. Lias, Rhoda D. Levin, and Sherif A. Kafafi
RDSH - Henry M. Rosenstock, Keith Draxl, Bruce W. Steiner, and John T. Herron
Quantity | Value | Units | Method | Reference | Comment |
---|---|---|---|---|---|
IE (evaluated) | 9.58 ± 0.02 | eV | N/A | N/A | L |
Ionization energy determinations
IE (eV) | Method | Reference | Comment |
---|---|---|---|
9.58 ± 0.02 | EI | Rosenstock, McCulloh, et al., 1977 | LLK |
9.58 ± 0.02 | PE | Bieri, Burger, et al., 1977 | LLK |
9.58 ± 0.02 | PE | Brogli, Heilbronner, et al., 1975 | LLK |
9.63 | PE | Bruckmann and Klessinger, 1973 | LLK |
9.9 | EI | Li and McGee, 1969 | RDSH |
9.9 | EI | Hedaya, Miller, et al., 1969 | RDSH |
9.87 | EI | Varsel, Morrell, et al., 1960 | RDSH |
9.9 | EI | Polyakova, Zimina, et al., 1960 | RDSH |
9.9 | EI | Polyakova, Zimina, et al., 1959 | RDSH |
9.64 ± 0.03 | PE | Van Hoorn, 1975 | Vertical value; LLK |
Appearance energy determinations
Ion | AE (eV) | Other Products | Method | Reference | Comment |
---|---|---|---|---|---|
C3H+ | 18.71 | ? | EI | Field, Franklin, et al., 1957 | RDSH |
C4H+ | 12.13 | H2+H | EI | Field, Franklin, et al., 1957 | RDSH |
C4H2+ | 12.84 | H2 | EI | Field, Franklin, et al., 1957 | RDSH |
C4H3+ | 12.59 | H | EI | Field, Franklin, et al., 1957 | RDSH |

Kovats' RI, non-polar column, isothermal

Column type | Active phase | Temperature (C) | I | Reference | Comment |
---|---|---|---|---|---|
Packed | Squalane | 27. | 373. | Hively and Hinton, 1968 | He, Chromosorb P; Column length: 15. m; Column diameter: 0.25 mm |
Packed | Squalane | 49. | 373. | Hively and Hinton, 1968 | He, Chromosorb P; Column length: 15. m; Column diameter: 0.25 mm |
Packed | Squalane | 67. | 374. | Hively and Hinton, 1968 | He, Chromosorb P; Column length: 15. m; Column diameter: 0.25 mm |
Packed | Squalane | 86. | 374. | Hively and Hinton, 1968 | He, Chromosorb P; Column length: 15. m; Column diameter: 0.25 mm |

Kovats' RI, non-polar column, custom temperature program

Column type | Active phase | I | Reference | Comment |
---|---|---|---|---|
Capillary | Petrocol DH-100 | 407.15 | Haagen-Smit Laboratory, 1997 | He; Column length: 100. m; Column diameter: 0.2 mm; Program: 5C(10min) => 5C/min => 50C(48min) => 1.5C/min => 195C(91min) |

Normal alkane RI, non-polar column, temperature ramp

Column type | Active phase | I | Reference | Comment |
---|---|---|---|---|
Capillary | Polydimethyl siloxane: CP-Sil 5 CB | 404. | Bramston-Cook, 2013 | 60. m/0.25 mm/1.0 μm, Helium, 45. C @ 1.45 min, 3.6 K/min, 210. C @ 2.72 min |
Capillary | OV-101 | 410. | Zenkevich, 2005 | 25. m/0.20 mm/0.10 μm, N2/He, 6. K/min; Tstart: 50. C; Tend: 250. C |

References

Roth, Adamczak, et al., 1991
Roth, W.R.; Adamczak, O.; Breuckmann, R.; Lennartz, H.-W.; Boese, R.,
Die Berechnung von Resonanzenergien; das MM2ERW-Kraftfeld,
Chem. Ber., 1991, 124, 2499-2521. [all data]
Stamm R.F., 1949
Stamm R.F.,
Fundamental vibrational frequencies and thermodynamic functions for vinylacetylene, revised thermodynamic functions for hydrogen cyanide, and thermodynamics of two reactions involved in the synthesis of acrylonitrile,
J. Chem. Phys., 1949, 17, 104-105. [all data]
Dorofeeva O.V., 1997
Dorofeeva O.V.,
Unpublished results. Thermocenter of Russian Academy of Science, Moscow, 1997. [all data]
Reppe, Schlichting, et al., 1948
Reppe, W.; Schlichting, O.; Klager, K.; Toepel, T.,
Cyclisierende Polymerisation von Acetylen I Uber Cyclooctatetraen,
Justus Liebigs Ann. Chem., 1948, 1-93. [all data]
Hennion, Price, et al., 1954
Hennion, G.F.; Price, C.C.; McKeon, T.F., Jr.,
The Preparation of Vinylacetylene,
J. Am. Chem. Soc., 1954, 76, 5160. [all data]
Stephenson and Malanowski, 1987
Stephenson, Richard M.; Malanowski, Stanislaw,
Handbook of the Thermodynamics of Organic Compounds, 1987, https://doi.org/10.1007/978-94-009-3173-2
. [all data]
Stull, 1947
Stull, Daniel R.,
Vapor Pressure of Pure Substances. Organic and Inorganic Compounds,
Ind. Eng. Chem., 1947, 39, 4, 517-540, https://doi.org/10.1021/ie50448a022
. [all data]
Rosenstock, McCulloh, et al., 1977
Rosenstock, H.M.; McCulloh, K.E.; Lossing, F.P.,
On the mechanisms of C6H6 ionization fragmentation,
Int. J. Mass Spectrom. Ion Phys., 1977, 25, 327. [all data]
Bieri, Burger, et al., 1977
Bieri, G.; Burger, F.; Heilbronner, E.; Maier, J.P.,
Valence ionization enrgies of hydrocarbons,
Helv. Chim. Acta, 1977, 60, 2213. [all data]
Brogli, Heilbronner, et al., 1975
Brogli, F.; Heilbronner, E.; Wirz, J.; Kloster-Jensen, E.; Bergman, R.G.; Vollhardt, K.P.C.; Ashe, A.J., III,
The consequences of σ and π conjugative interactions in mono-, di- and triacetylenes. A photoelectron spectroscopic investigation,
Helv. Chim. Acta, 1975, 58, 2620. [all data]
Bruckmann and Klessinger, 1973
Bruckmann, P.; Klessinger, M.,
Photoelektronenspektren organischer verbindungen. III. Photoelektronenspektren acetylensubstituierter kleiner ringe,
J. Electron Spectrosc. Relat. Phenom., 1973, 2, 341. [all data]
Li and McGee, 1969
Li, P.H.; McGee, H.A., Jr.,
Mass spectrum and ionization potential of condensed cyclobutadiene,
Chem. Commun., 1969, 592. [all data]
Hedaya, Miller, et al., 1969
Hedaya, E.; Miller, R.D.; McNeil, D.W.; D'Angelo, P.F.; Schissel, P.,
Flash vacuum pyrolysis. V. Cyclobutadiene,
J. Am. Chem. Soc., 1969, 91, 1875. [all data]
Varsel, Morrell, et al., 1960
Varsel, C.J.; Morrell, F.A.; Resnik, F.E.; Powell, W.A.,
Qualitative and quantitative analysis of organic compounds. Use of low-voltage mass spectrometry,
Anal. Chem., 1960, 32, 182. [all data]
Polyakova, Zimina, et al., 1960
Polyakova, A.A.; Zimina, K.I.; Petrov, A.A.; Khmel'nitskii, R.A.,
Mass spectra of vinylalkylacetylenes,
Zh. Obshch. Khim., 1960, 30, 912, In original 927. [all data]
Polyakova, Zimina, et al., 1959
Polyakova, A.A.; Zimina, K.I.; Petrov, A.A.; Klmel'nitskii, R.A.,
Mass Spectra and the structure of vinylacetylenes,
Dokl. Phys. Chem., 1959, 127, 597, In original 386. [all data]
Van Hoorn, 1975
Van Hoorn, M.D.,
He(I) ionisation potentials and MO calculations of butenyne and the monomethyl-substituted butenynes,
J. Electron Spectrosc. Relat. Phenom., 1975, 6, 65. [all data]
Field, Franklin, et al., 1957
Field, F.H.; Franklin, J.L.; Lampe, F.W.,
Reactions of gaseous ions. II. Acetylene,
J. Am. Chem. Soc., 1957, 79, 2665. [all data]
Hively and Hinton, 1968
Hively, R.A.; Hinton, R.E.,
Variation of the retention index with temperature on squalane substrates,
J. Gas Chromatogr., 1968, 6, 4, 203-217, https://doi.org/10.1093/chromsci/6.4.203
. [all data]
Haagen-Smit Laboratory, 1997
Haagen-Smit Laboratory,
Procedure for the detailed hydrocarbon analysis of gasolines by single column high efficiency (capillary) column gas chromatography, SOP NO. MLD 118, Revision No. 1.1, California Environmental Protection Agency, Air Resources Board, El Monte, California, 1997, 22. [all data]
Bramston-Cook, 2013
Bramston-Cook, R.,
Kovats indices for C2-C13 hydrocarbons and selected oxygenated/halocarbons with 100 % dimethylpolysiloxane columns, 2013, retrieved from http://lotusinstruments.com/monographs/List .... [all data]
Zenkevich, 2005
Zenkevich, I.G.,
Experimentally measured retention indices., 2005. [all data]