Hydrazine, 1,2-dimethyl 1,2-dineopentyl-
- Formula: C12H28N2
- Molecular weight: 200.3641
- CAS Registry Number: 68970-09-2

Gas phase ion energetics data

Data evaluated as indicated in comments:
HL - Edward P. Hunter and Sharon G. Lias
Data compiled as indicated in comments:
LBLHLM - Sharon G. Lias, John E. Bartmess, Joel F. Liebman, John L. Holmes, Rhoda D. Levin, and W. Gary Mallard
Quantity | Value | Units | Method | Reference | Comment |
---|---|---|---|---|---|
Proton affinity (review) | 233.7 | kcal/mol | N/A | Hunter and Lias, 1998 | HL |
Quantity | Value | Units | Method | Reference | Comment |
Gas basicity | 226.4 | kcal/mol | N/A | Hunter and Lias, 1998 | HL |
Ionization energy determinations
IE (eV) | Method | Reference | Comment |
---|---|---|---|
6.58 ± 0.05 | EQ | Rumack, 1986 | LBLHLM |
8.16 | PE | Nelsen, 1984 | Vertical value; LBLHLM |

References

Hunter and Lias, 1998
Hunter, E.P.; Lias, S.G.,
Evaluated Gas Phase Basicities and Proton Affinities of Molecules: An Update,
J. Phys. Chem. Ref. Data, 1998, 27, 3, 413-656, https://doi.org/10.1063/1.556018
. [all data]
Rumack, 1986
Rumack, D.,
Title unavailable,
Personal communication to S.G. Lias, 1986. [all data]
Nelsen, 1984
Nelsen, S.F.,
Ionization from nitrogen and oxygen lone pairs: A comparison of trialkylamine, dialkyl ether, tetraalkylhydrazine, and dialkyl peroxide photoelectron spectroscopic ionization potentials,
J. Org. Chem., 1984, 49, 1891. [all data]