6H-Purin-6-one, 1,7-dihydro-
- Formula: C5H4N4O
- Molecular weight: 136.1115
- IUPAC Standard InChIKey: FDGQSTZJBFJUBT-UHFFFAOYSA-N
- CAS Registry Number: 68-94-0
- Chemical structure:

Condensed phase thermochemistry data

Data compiled as indicated in comments:
ALS - Hussein Y. Afeefy, Joel F. Liebman, and Stephen E. Stein
DH - Eugene S. Domalski and Elizabeth D. Hearing
Quantity | Value | Units | Method | Reference | Comment |
---|---|---|---|---|---|
ΔfH°solid | -110.8 ± 0.75 | kJ/mol | Ccb | Stiehler and Huffman, 1935 | Reanalyzed by Cox and Pilcher, 1970, Original value = -115.6 kJ/mol; ALS |
Quantity | Value | Units | Method | Reference | Comment |
ΔcH°solid | -2428.5 ± 0.71 | kJ/mol | Ccb | Stiehler and Huffman, 1935 | Reanalyzed by Cox and Pilcher, 1970, Original value = -2427.6 ± 0.59 kJ/mol; ALS |
Quantity | Value | Units | Method | Reference | Comment |
S°solid,1 bar | 145.6 | J/mol*K | N/A | Stiehler and Huffman, 1935, 2 | Extrapolation below 90 K, 45.56 J/mol*K.; DH |
Constant pressure heat capacity of solid
Cp,solid (J/mol*K) | Temperature (K) | Reference | Comment |
---|---|---|---|
134.52 | 298.5 | Stiehler and Huffman, 1935, 2 | T = 85 to 298 K. Value is unsmoothed experimental datum.; DH |

Phase change data

Data compiled by: William E. Acree, Jr., James S. Chickos
Enthalpy of sublimation
ΔsubH (kJ/mol) | Temperature (K) | Reference | Comment |
---|---|---|---|
158.1 ± 1.6 | 448. | Teplitskii and Yanson, 1975 | Based on data from 423. to 473. K. |

Gas phase ion energetics data

Data evaluated as indicated in comments:
HL - Edward P. Hunter and Sharon G. Lias
Data compiled as indicated in comments:
LLK - Sharon G. Lias, Rhoda D. Levin, and Sherif A. Kafafi
RDSH - Henry M. Rosenstock, Keith Draxl, Bruce W. Steiner, and John T. Herron
Quantity | Value | Units | Method | Reference | Comment |
---|---|---|---|---|---|
Proton affinity (review) | 912.3 | kJ/mol | N/A | Hunter and Lias, 1998 | HL |
Quantity | Value | Units | Method | Reference | Comment |
Gas basicity | 880.5 | kJ/mol | N/A | Hunter and Lias, 1998 | HL |
Ionization energy determinations
IE (eV) | Method | Reference | Comment |
---|---|---|---|
9. ± 0. | EI | Lifschitz, Bergmann, et al., 1967 | RDSH |
8.55 ± 0.03 | PE | Hush and Cheung, 1975 | Vertical value; LLK |

References

Stiehler and Huffman, 1935
Stiehler, R.D.; Huffman, H.M.,
Thermal data. IV. The heats of combustion of adenine, hypoxanthine, guanine, xanthine, uric acid, allantoin and alloxan,
J. Am. Chem. Soc., 1935, 57, 1734-1740. [all data]
Cox and Pilcher, 1970
Cox, J.D.; Pilcher, G.,
Thermochemistry of Organic and Organometallic Compounds, Academic Press, New York, 1970, 1-636. [all data]
Stiehler and Huffman, 1935, 2
Stiehler, R.D.; Huffman, H.M.,
Thermal data. V. The heat capacities, entropies and free energies of adenine, hypoxanthine, guanine, xanthine, uric acid, allantoin and alloxan,
J. Am. Chem. Soc., 1935, 57, 1741-1743. [all data]
Teplitskii and Yanson, 1975
Teplitskii, A.B.; Yanson, I.K.,
Effect of substituents on the heat of sublimation of nucleic acid nitrogenous bases,
Biofizika, 1975, 20, 189. [all data]
Hunter and Lias, 1998
Hunter, E.P.; Lias, S.G.,
Evaluated Gas Phase Basicities and Proton Affinities of Molecules: An Update,
J. Phys. Chem. Ref. Data, 1998, 27, 3, 413-656, https://doi.org/10.1063/1.556018
. [all data]
Lifschitz, Bergmann, et al., 1967
Lifschitz, C.; Bergmann, E.D.; Pullman, B.,
The ionization potentials of biological purines and pyrimidines,
Tetrahedron Lett., 1967, 4583. [all data]
Hush and Cheung, 1975
Hush, N.S.; Cheung, A.S.,
Ionization potentials and donor properties of nucleic acid bases and related compounds,
Chem. Phys. Lett., 1975, 34, 11. [all data]