4(1H)-Pyridinethione,1-methyl-
- Formula: C6H7NS
- Molecular weight: 125.191
- IUPAC Standard InChIKey: AXSKLZVLVONUIC-UHFFFAOYSA-N
- CAS Registry Number: 6887-59-8
- Chemical structure:
View 3d structure (requires JavaScript / HTML 5) - Permanent link for this species. Use this link for bookmarking this species for future reference.

Phase change data

Data compiled as indicated in comments:
ALS - Hussein Y. Afeefy, Joel F. Liebman, and Stephen E. Stein
AC - William E. Acree, Jr., James S. Chickos
Quantity | Value | Units | Method | Reference | Comment |
---|---|---|---|---|---|
ΔvapH° | 172. ± 8.4 | kJ/mol | V | Beak, Mueller, et al., 1974 | ALS |
Enthalpy of sublimation
ΔsubH (kJ/mol) | Temperature (K) | Method | Reference | Comment |
---|---|---|---|---|
188.3 ± 9.2 | 452. | B | Beak, Mueller, et al., 1974 | Based on data from 440. to 465. K.; AC |

Reaction thermochemistry data

Data compiled by: Hussein Y. Afeefy, Joel F. Liebman, and Stephen E. Stein
Individual Reactions
By formula: C6H7NS = C6H7NS
Quantity | Value | Units | Method | Reference | Comment |
---|---|---|---|---|---|
ΔrH° | -2. ± 5.0 | kJ/mol | Ciso | Beak, Mueller, et al., 1974 | liquid phase; solvent: 1,2-Dichloroethane; #LED |
ΔrH° | -117. ± 16. | kJ/mol | Ciso | Beak, Mueller, et al., 1974 | gas phase; Hr gas phase |

Gas phase ion energetics data

Data compiled as indicated in comments:
LLK - Sharon G. Lias, Rhoda D. Levin, and Sherif A. Kafafi
Ionization energy determinations
IE (eV) | Method | Reference | Comment |
---|---|---|---|
7.54 ± 0.02 | EI | Gronneberg and Undheim, 1972 | LLK |
7.6 ± 0.03 | PE | Cook, El-Abbady, et al., 1977 | Vertical value; LLK |

References

Beak, Mueller, et al., 1974
Beak, P.; Mueller, D.S.; Lee, J.,
Equilibration studies. Determination of the enthalpy difference between methyltropic isomers from heats of methylation,
J. Am. Chem. Soc., 1974, 96, 3867-3874. [all data]
Gronneberg and Undheim, 1972
Gronneberg, T.; Undheim, K.,
Mass spectrometry of onium compounds. XI: ionization potentials of hydroxy and mercapto pyridines,
Org. Mass Spectrom., 1972, 6, 823. [all data]
Cook, El-Abbady, et al., 1977
Cook, M.J.; El-Abbady, S.; Katritzky, A.R.; Guimon, C.; Pfister-Guillouzo, G.,
Photoelectron spectra of hydroxy- and mercapto-pyridines and models of fixed structure,
J. Chem. Soc. Perkin Trans. 2, 1977, 1652. [all data]