tri-n-Butyltin hydride
- Formula: C12H28Sn
- Molecular weight: 291.061
- IUPAC Standard InChIKey: DBGVGMSCBYYSLD-UHFFFAOYSA-N
- CAS Registry Number: 688-73-3
- Chemical structure:

Gas phase ion energetics data

Data compiled by: Sharon G. Lias, Rhoda D. Levin, and Sherif A. Kafafi
Ionization energy determinations
IE (eV) | Method | Reference | Comment |
---|---|---|---|
8.8 | PE | Beltram, Fehlner, et al., 1980 | Vertical value |

References

Beltram, Fehlner, et al., 1980
Beltram, G.; Fehlner, T.P.; Mochida, K.; Kochi, J.K.,
UV photoelectron spectra of group IV alkyl hydrides,
J. Electron Spectrosc. Relat. Phenom., 1980, 18, 153. [all data]