Uranium, bis[(η8-1,3,5,7-cyclooctatetraenyl)trimethylsilane]-

Gas phase ion energetics data

Data compiled by: Sharon G. Lias, John E. Bartmess, Joel F. Liebman, John L. Holmes, Rhoda D. Levin, and W. Gary Mallard

Ionization energy determinations

IE (eV) Method Reference Comment
5.8PEBruno, Ciliberto, et al., 1982
6.05PEBruno, Ciliberto, et al., 1982Vertical value

References

Bruno, Ciliberto, et al., 1982
Bruno, G.; Ciliberto, E.; Fischer, R.D.; Fragala, I.; Spieg, A.W., Photoelectron spectroscopy of f-element organometallic complexes. 5. Comparative study of ring-substituted uranocenes, Organometallics, 1982, 1, 1060. [all data]