Silyl trifluoroacetate
- Formula: C2H3F3O2Si
- Molecular weight: 144.1247
- IUPAC Standard InChIKey: GWPZHWIVXJVWCQ-UHFFFAOYSA-N
- CAS Registry Number: 6876-44-4
- Chemical structure:
View 3d structure (requires JavaScript / HTML 5) - Permanent link for this species. Use this link for bookmarking this species for future reference.

Phase change data

Data compiled by: William E. Acree, Jr., James S. Chickos
Enthalpy of vaporization
ΔvapH (kJ/mol) | Temperature (K) | Method | Reference | Comment |
---|---|---|---|---|
30.7 | 283. | A | Stephenson and Malanowski, 1987 | Based on data from 273. to 293. K. See also Ebsworth and Thompson, 1967. |

References

Stephenson and Malanowski, 1987
Stephenson, Richard M.; Malanowski, Stanislaw,
Handbook of the Thermodynamics of Organic Compounds, 1987, https://doi.org/10.1007/978-94-009-3173-2
. [all data]
Ebsworth and Thompson, 1967
Ebsworth, E.A.V.; Thompson, J.C.,
The preparation and properties of some silyl esters,
J. Chem. Soc., A, 1967, 69, https://doi.org/10.1039/j19670000069
. [all data]