Acetamide, N,N-diethyl-
- Formula: C6H13NO
- Molecular weight: 115.1735
- IUPAC Standard InChIKey: AJFDBNQQDYLMJN-UHFFFAOYSA-N
- CAS Registry Number: 685-91-6
- Chemical structure:
View 3d structure (requires JavaScript / HTML 5) - Other names: N,N-Diethylacetamide; CH3CON(C2H5)2

Gas phase thermochemistry data

Data compiled by: Hussein Y. Afeefy, Joel F. Liebman, and Stephen E. Stein
Quantity | Value | Units | Method | Reference | Comment |
---|---|---|---|---|---|
ΔfH°gas | -287.2 | kJ/mol | Ccb | Vasil'eva, 1984 |

Condensed phase thermochemistry data

Data compiled by: Hussein Y. Afeefy, Joel F. Liebman, and Stephen E. Stein
Quantity | Value | Units | Method | Reference | Comment |
---|---|---|---|---|---|
ΔfH°liquid | -335.4 ± 3.2 | kJ/mol | Ccb | Vasil'eva, 1984 | |
Quantity | Value | Units | Method | Reference | Comment |
ΔcH°liquid | -3883.6 ± 3.2 | kJ/mol | Ccb | Vasil'eva, 1984 |

Phase change data

Data compiled as indicated in comments:
BS - Robert L. Brown and Stephen E. Stein
ALS - Hussein Y. Afeefy, Joel F. Liebman, and Stephen E. Stein
Quantity | Value | Units | Method | Reference | Comment |
---|---|---|---|---|---|
Tboil | 457.2 | K | N/A | Aldrich Chemical Company Inc., 1990 | BS |
Quantity | Value | Units | Method | Reference | Comment |
ΔvapH° | 48.2 | kJ/mol | V | Vasil'eva, 1984 | ALS |

Gas phase ion energetics data

Data evaluated as indicated in comments:
HL - Edward P. Hunter and Sharon G. Lias
Data compiled as indicated in comments:
RDSH - Henry M. Rosenstock, Keith Draxl, Bruce W. Steiner, and John T. Herron
Quantity | Value | Units | Method | Reference | Comment |
---|---|---|---|---|---|
Proton affinity (review) | 925.4 | kJ/mol | N/A | Hunter and Lias, 1998 | HL |
Quantity | Value | Units | Method | Reference | Comment |
Gas basicity | 894.4 | kJ/mol | N/A | Hunter and Lias, 1998 | HL |
Ionization energy determinations
IE (eV) | Method | Reference | Comment |
---|---|---|---|
8.60 ± 0.02 | PI | Watanabe, Nakayama, et al., 1962 | RDSH |

Kovats' RI, non-polar column, isothermal

Column type | Active phase | Temperature (C) | I | Reference | Comment |
---|---|---|---|---|---|
Packed | Apiezon L | 150. | 985. | Zhuravleva I.L., Golovnya R.V., et al., 1978 | N2, Chromosorb G-AW; Column length: 2.7 m |

Kovats' RI, polar column, isothermal

Column type | Active phase | Temperature (C) | I | Reference | Comment |
---|---|---|---|---|---|
Packed | Polyethylene Glycol | 150. | 1595. | Zhuravleva I.L., Golovnya R.V., et al., 1978 | N2, Chromosorb G-AW; Column length: 2.7 m |

Normal alkane RI, non-polar column, custom temperature program

Column type | Active phase | I | Reference | Comment |
---|---|---|---|---|
Capillary | Polydimethyl siloxanes | 966. | Zenkevich and Chupalov, 1996 | Program: not specified |

References

Vasil'eva, 1984
Vasil'eva, T.F.,
Enthalpy of formation of N,N-diethylacetamide and thermal effects of the synthesis of dialkyl-substituted amides,
J. Appl. Chem. USSR, 1984, 57, 1755-1757. [all data]
Aldrich Chemical Company Inc., 1990
Aldrich Chemical Company Inc.,
Catalog Handbook of Fine Chemicals, Aldrich Chemical Company, Inc., Milwaukee WI, 1990, 1. [all data]
Hunter and Lias, 1998
Hunter, E.P.; Lias, S.G.,
Evaluated Gas Phase Basicities and Proton Affinities of Molecules: An Update,
J. Phys. Chem. Ref. Data, 1998, 27, 3, 413-656, https://doi.org/10.1063/1.556018
. [all data]
Watanabe, Nakayama, et al., 1962
Watanabe, K.; Nakayama, T.; Mottl, J.,
Ionization potentials of some molecules,
J. Quant. Spectry. Radiative Transfer, 1962, 2, 369. [all data]
Nielsen and Schellman, 1967
Nielsen, E.B.; Schellman, J.A.,
The absorption spectra of simple amides and peptides,
J. Phys. Chem., 1967, 71, 7, 2297-2304. [all data]
Zhuravleva I.L., Golovnya R.V., et al., 1978
Zhuravleva I.L.; Golovnya R.V.; Palamarchuk L.F.; Kishkovskii Z.N.,
Gas-chromatographic determination of N-monoalkylacetamides,
J. Anal. Chem. USSR (Engl. Transl.), 1978, 33, 11, 1717-1719. [all data]
Zenkevich and Chupalov, 1996
Zenkevich, I.G.; Chupalov, A.A.,
New Possibilities of Chromato Mass Pectrometric Identification of Organic Compounds Using Increments of Gas Chromatographic Retention Indices of Molecular Structural Fragments,
Zh. Org. Khim. (Rus.), 1996, 32, 5, 656-666. [all data]