1,3-Butadiene, 1,1,2,3,4,4-hexafluoro-
- Formula: C4F6
- Molecular weight: 162.0332
- IUPAC Standard InChIKey: LGPPATCNSOSOQH-UHFFFAOYSA-N
- CAS Registry Number: 685-63-2
- Chemical structure:
View 3d structure (requires JavaScript / HTML 5) - Other names: Hexafluoro-1,3-butadiene; Perfluoro-1,3-butadiene; 1,1,2,3,4,4-Hexafluoro-1,3-butadiene; CF2=CFCF=CF2; Perfluorobutadiene-1,3; Hexafluorobutadiene-1,3; 1,1,2,3,4,4-hexafluorobuta-1,3-diene

Gas phase thermochemistry data

Data compiled as indicated in comments:
ALS - Hussein Y. Afeefy, Joel F. Liebman, and Stephen E. Stein
Quantity | Value | Units | Method | Reference | Comment |
---|---|---|---|---|---|
ΔfH°gas | -1060. | kJ/mol | Semi | Stewart, 2004 | |
ΔfH°gas | -942.2 | kJ/mol | Cm | Andreevskii and Antonova, 1982 | ALS |

Phase change data

Data compiled as indicated in comments:
BS - Robert L. Brown and Stephen E. Stein
AC - William E. Acree, Jr., James S. Chickos
Quantity | Value | Units | Method | Reference | Comment |
---|---|---|---|---|---|
Tboil | 279. to 280. | K | N/A | PCR Inc., 1990 | BS |
Enthalpy of vaporization
ΔvapH (kJ/mol) | Temperature (K) | Reference | Comment |
---|---|---|---|
25.9 | 288. | Bobbo, Fedele, et al., 2002 | Based on data from 273. to 343. K.; AC |

Gas phase ion energetics data

Data compiled as indicated in comments:
RDSH - Henry M. Rosenstock, Keith Draxl, Bruce W. Steiner, and John T. Herron
Ionization energy determinations
IE (eV) | Method | Reference | Comment |
---|---|---|---|
~9.5 | PE | Brundle and Robin, 1970 | RDSH |

References

Stewart, 2004
Stewart, J.J.P.,
Comparison of the accuracy of semiempirical and some DFT methods for predicting heats of formation,
J. Mol. Model, 2004, 10, 1, 6-10, https://doi.org/10.1007/s00894-003-0157-6
. [all data]
Andreevskii and Antonova, 1982
Andreevskii, D.N.; Antonova, Z.A.,
Development of an increment scheme for calculating the thermodynamic properties of organic polyfluoro compounds,
J. Appl. Chem. USSR, 1982, 55, 582-587. [all data]
PCR Inc., 1990
PCR Inc.,
Research Chemicals Catalog 1990-1991, PCR Inc., Gainesville, FL, 1990, 1. [all data]
Bobbo, Fedele, et al., 2002
Bobbo, Sergio; Fedele, Laura; Scattolini, Mauro; Camporese, Roberto,
Compressed Liquid Densities, Saturated Liquid Densities, and Vapor Pressures of Hexafluoro-1,3-butadiene (C 4 F 6 ),
J. Chem. Eng. Data, 2002, 47, 2, 179-182, https://doi.org/10.1021/je010194d
. [all data]
Brundle and Robin, 1970
Brundle, C.R.; Robin, M.B.,
Nonplanarity in hexafluorobutadiene as revealed by photoelectron and optical spectroscopy,
J. Am. Chem. Soc., 1970, 92, 5550. [all data]
Pottier, et al., 1969
Pottier, R.H., et al.,
Spectroscopy Letters, 1969, 2, 369. [all data]