7,8-Dioxabicyclo[4.2.1]nonane
- Formula: C7H12O2
- Molecular weight: 128.1690
- IUPAC Standard InChIKey: LKNKAJUDGBRRBI-UHFFFAOYSA-N
- CAS Registry Number: 68525-35-9
- Chemical structure:
View 3d structure (requires JavaScript / HTML 5) - Permanent link for this species. Use this link for bookmarking this species for future reference.

Gas phase ion energetics data

Data compiled as indicated in comments:
LBLHLM - Sharon G. Lias, John E. Bartmess, Joel F. Liebman, John L. Holmes, Rhoda D. Levin, and W. Gary Mallard
Ionization energy determinations
IE (eV) | Method | Reference | Comment |
---|---|---|---|
8.5 | PE | Gleiter, Dobler, et al., 1984 | LBLHLM |
8.9 | PE | Gleiter, Dobler, et al., 1984 | Vertical value; LBLHLM |

References

Gleiter, Dobler, et al., 1984
Gleiter, R.; Dobler, W.; Eckert-Maksic, M.; Bloodworth, A.J.; Eggelte, H.J.; Cremer, D.,
Photoelectron spectra of dioxabicyclo[n.2.1]alkanes,
J. Org. Chem., 1984, 49, 3716. [all data]