Ethane, 1,2-dibromo-1,2-dichloro-
- Formula: C2H2Br2Cl2
- Molecular weight: 256.751
- IUPAC Standard InChIKey: RJMDFMUPJANPGX-UHFFFAOYSA-N
- CAS Registry Number: 683-68-1
- Chemical structure:
View 3d structure (requires JavaScript / HTML 5) - Other names: 1,2-Dibromo-1,2-dichloroethane; 1,2-Dichloro-1,2-dibromoethane; rac-1,2-Dibromo-1,2-dichloroethane

Phase change data

Data compiled as indicated in comments:
BS - Robert L. Brown and Stephen E. Stein
AC - William E. Acree, Jr., James S. Chickos
Quantity | Value | Units | Method | Reference | Comment |
---|---|---|---|---|---|
Tboil | 468.2 | K | N/A | Weast and Grasselli, 1989 | BS |
Enthalpy of vaporization
ΔvapH (kJ/mol) | Temperature (K) | Method | Reference | Comment |
---|---|---|---|---|
45.9 | 335. | A | Stephenson and Malanowski, 1987 | Based on data from 320. to 379. K.; AC |

Reaction thermochemistry data

Data compiled by: Hussein Y. Afeefy, Joel F. Liebman, and Stephen E. Stein
Individual Reactions
By formula: C2H2Cl2 + Br2 = C2H2Br2Cl2
Quantity | Value | Units | Method | Reference | Comment |
---|---|---|---|---|---|
ΔrH° | -72.4 | kJ/mol | Eqk | Muller and Schumacher, 1939 | gas phase |

Normal alkane RI, non-polar column, custom temperature program

Column type | Active phase | I | Reference | Comment |
---|---|---|---|---|
Capillary | OV-1, SE-30, Methyl silicone, SP-2100, OV-101, DB-1, etc. | 1073. | Waggott and Davies, 1984 | Hydrogen; Column length: 50. m; Column diameter: 0.32 mm; Program: not specified |

References

Weast and Grasselli, 1989
CRC Handbook of Data on Organic Compounds, 2nd Editon, Weast,R.C and Grasselli, J.G., ed(s)., CRC Press, Inc., Boca Raton, FL, 1989, 1. [all data]
Stephenson and Malanowski, 1987
Stephenson, Richard M.; Malanowski, Stanislaw,
Handbook of the Thermodynamics of Organic Compounds, 1987, https://doi.org/10.1007/978-94-009-3173-2
. [all data]
Muller and Schumacher, 1939
Muller, K.L.; Schumacher, H.J.,
Die photochemische bromierung von transdichlorathylen und der photochemische durch brom sensibilisierte zerfall von dichlordibromathan,
Z. Phys. Chem., 1939, 42, 327-345. [all data]
Waggott and Davies, 1984
Waggott, A.; Davies, I.W.,
Identification of organic pollutants using linear temperature programmed retention indices (LTPRIs) - Part II, 1984, retrieved from http://dwi.defra.gov.uk/research/completed-research/reports/dwi0383.pdf. [all data]