3-Pyrrolidone, 1-methyl-
- Formula: C5H9NO
- Molecular weight: 99.1311
- IUPAC Standard InChIKey: SLPUTJFVMJPMKV-UHFFFAOYSA-N
- CAS Registry Number: 68165-06-0
- Chemical structure:
View 3d structure (requires JavaScript / HTML 5) - Permanent link for this species. Use this link for bookmarking this species for future reference.

Gas phase ion energetics data

Data compiled as indicated in comments:
LLK - Sharon G. Lias, Rhoda D. Levin, and Sherif A. Kafafi
Ionization energy determinations
IE (eV) | Method | Reference | Comment |
---|---|---|---|
8.3 | PE | Gerson, Worley, et al., 1978 | LLK |
8.83 | PE | Gerson, Worley, et al., 1978 | Vertical value; LLK |

References

Gerson, Worley, et al., 1978
Gerson, S.H.; Worley, S.D.; Bodor, N.; Kaminski, J.J.; Flechtner, T.W.,
The photoelectron spectra of some heterocyclic compounds which contain N, O, Cl, and Br,
J. Electron Spectrosc. Relat. Phenom., 1978, 13, 421. [all data]