Difluoraminooxysulfonyl fluoride
- Formula: F3NO3S
- Molecular weight: 151.065
- IUPAC Standard InChIKey: QHTHRNRJCFZCCA-UHFFFAOYSA-N
- CAS Registry Number: 6816-12-2
- Chemical structure:
View 3d structure (requires JavaScript / HTML 5) - Permanent link for this species. Use this link for bookmarking this species for future reference.

Phase change data

Data compiled by: William E. Acree, Jr., James S. Chickos
Enthalpy of vaporization
ΔvapH (kJ/mol) | Temperature (K) | Reference | Comment |
---|---|---|---|
24.6 | 239. | Lustig and Cady, 1963 | Based on data from 206. to 272. K. |

Gas phase ion energetics data

Data compiled by: Henry M. Rosenstock, Keith Draxl, Bruce W. Steiner, and John T. Herron
Appearance energy determinations
Ion | AE (eV) | Other Products | Method | Reference | Comment |
---|---|---|---|---|---|
SO2F+ | 13.3 ± 0.2 | ? | EI | Paulett and Lustig, 1965 | |
NF2+ | 13.3 ± 0.1 | ? | EI | Paulett and Lustig, 1965 |

References

Lustig and Cady, 1963
Lustig, Max; Cady, George H.,
Preparation and Properties of N,N-Difluorohydroyxlamine-O-fluorosulfonate, NF 2 OSO 2 F,
Inorg. Chem., 1963, 2, 2, 388-390, https://doi.org/10.1021/ic50006a036
. [all data]
Paulett and Lustig, 1965
Paulett, G.S.; Lustig, M.,
Sulfur-nitrogen and oxygen-nitrogen bond dissociation energies of some N-fluorinated amines,
J. Am. Chem. Soc., 1965, 87, 1020. [all data]