Cyclopentane, hexadecyl-
- Formula: C21H42
- Molecular weight: 294.5582
- IUPAC Standard InChIKey: YUMSFAHUVUYTKV-UHFFFAOYSA-N
- CAS Registry Number: 6812-39-1
- Chemical structure:
View 3d structure (requires JavaScript / HTML 5) - Other names: n-Hexadecylcyclopentane

Gas phase thermochemistry data

Data compiled by: Hussein Y. Afeefy, Joel F. Liebman, and Stephen E. Stein
Quantity | Value | Units | Method | Reference | Comment |
---|---|---|---|---|---|
ΔfH°gas | -415.6 ± 3.6 | kJ/mol | Ccb | Prosen, Johnson, et al., 1946 | Heat of combustion of the gas |

Condensed phase thermochemistry data

Data compiled by: Hussein Y. Afeefy, Joel F. Liebman, and Stephen E. Stein
Quantity | Value | Units | Method | Reference | Comment |
---|---|---|---|---|---|
ΔcH°liquid | -13850.8 ± 3.3 | kJ/mol | Ccb | Prosen, Johnson, et al., 1946 | Heat of combustion of the gas; Corresponding ΔfHºliquid = -415.3 kJ/mol (simple calculation by NIST; no Washburn corrections) |

Phase change data

Data compiled as indicated in comments:
TRC - Thermodynamics Research Center, NIST Boulder Laboratories, Chris Muzny director
AC - William E. Acree, Jr., James S. Chickos
Quantity | Value | Units | Method | Reference | Comment |
---|---|---|---|---|---|
Tfus | 292.7 | K | N/A | Schmidt, 1942 | Uncertainty assigned by TRC = 1. K; TRC |
Tfus | 292.7 | K | N/A | Schmidt and Gemassmer, 1940 | Uncertainty assigned by TRC = 1. K; TRC |
Quantity | Value | Units | Method | Reference | Comment |
ΔvapH° | 105.3 | kJ/mol | N/A | Reid, 1972 | AC |
Enthalpy of vaporization
ΔvapH (kJ/mol) | Temperature (K) | Reference | Comment |
---|---|---|---|
79.2 | 513. | Dykyj, Svoboda, et al., 1999 | Based on data from 498. to 674. K.; AC |

Kovats' RI, non-polar column, isothermal

View large format table.

Column type Active phase Temperature (C) I Reference Comment
CapillaryOV-101190.2162.Kusmierz, Malinski, et al., 1985Column length: 22. m; Column diameter: 0.3 mm
CapillaryApiezon L190.2175.9Kusmierz, Malinski, et al., 1985He; Column length: 20. m; Column diameter: 0.3 mm
CapillarySE-52190.2167.4Kusmierz, Malinski, et al., 1985He; Column length: 40. m; Column diameter: 0.3 mm

Kovats' RI, polar column, isothermal

View large format table.

Column type Active phase Temperature (C) I Reference Comment
CapillaryCarbowax 20M150.2184.4Kusmierz, Malinski, et al., 1985He; Column length: 30. m; Column diameter: 0.25 mm

References

Prosen, Johnson, et al., 1946
Prosen, E.J.; Johnson, W.H.; Rossini, F.D.,
Heats of formation and combustion of the normal alkylcyclopentanes and cyclohexanes and the increment per CH2 group for several homologous series of hydrocarbons,
J. Res. NBS, 1946, 37, 51-56. [all data]
Schmidt, 1942
Schmidt, A.W.,
Physical properties of aliphatic compounds,
Ber. Dtsch. Chem. Ges. B, 1942, 75, 1399. [all data]
Schmidt and Gemassmer, 1940
Schmidt, A.W.; Gemassmer, A.,
Physical data of monoalkylcyclopentanes ???.,
Ber. Dtsch. Chem. Ges. B, 1940, 73, 359-66. [all data]
Reid, 1972
Reid, Robert C.,
Handbook on vapor pressure and heats of vaporization of hydrocarbons and related compounds, R. C. Wilhort and B. J. Zwolinski, Texas A Research Foundation. College Station, Texas(1971). 329 pages.$10.00,
AIChE J., 1972, 18, 6, 1278-1278, https://doi.org/10.1002/aic.690180637
. [all data]
Dykyj, Svoboda, et al., 1999
Dykyj, J.; Svoboda, J.; Wilhoit, R.C.; Frenkel, M.L.; Hall, K.R.,
Vapor Pressure of Chemicals: Part A. Vapor Pressure and Antoine Constants for Hydrocarbons and Sulfur, Selenium, Tellurium and Hydrogen Containing Organic Compounds, Springer, Berlin, 1999, 373. [all data]