Butane, 2-methoxy-
- Formula: C5H12O
- Molecular weight: 88.1482
- IUPAC Standard InChIKey: FVNIMHIOIXPIQT-UHFFFAOYSA-N
- CAS Registry Number: 6795-87-5
- Chemical structure:
View 3d structure (requires JavaScript / HTML 5) - Other names: Ether, sec-butyl methyl; sec-Butyl Methyl ether; Methyl sec-butyl ether

Phase change data

Data compiled as indicated in comments:
TRC - Thermodynamics Research Center, NIST Boulder Laboratories, Chris Muzny director
Quantity | Value | Units | Method | Reference | Comment |
---|---|---|---|---|---|
Tboil | 332.2 | K | N/A | Majer and Svoboda, 1985 | |
Tboil | 334. | K | N/A | Wiberg, 1952 | Uncertainty assigned by TRC = 3. K; TRC |
Quantity | Value | Units | Method | Reference | Comment |
ΔvapH° | 30.41 | kJ/mol | N/A | Majer and Svoboda, 1985 |
Enthalpy of vaporization
ΔvapH (kJ/mol) | Temperature (K) | Reference | Comment |
---|---|---|---|
28.09 | 332.2 | Majer and Svoboda, 1985 |

Reaction thermochemistry data

Data compiled by: Hussein Y. Afeefy, Joel F. Liebman, and Stephen E. Stein
Individual Reactions
By formula: H2 + C5H10O = C5H12O
Quantity | Value | Units | Method | Reference | Comment |
---|---|---|---|---|---|
ΔrH° | -104. ± 0.8 | kJ/mol | Chyd | Dolliver, Gresham, et al., 1938 | gas phase; At 355°K |

Gas phase ion energetics data

Data compiled by: Sharon G. Lias, John E. Bartmess, Joel F. Liebman, John L. Holmes, Rhoda D. Levin, and W. Gary Mallard
Ionization energy determinations
IE (eV) | Method | Reference |
---|---|---|
9.21 ± 0.07 | EI | Bowen and Maccoll, 1984 |

References

Majer and Svoboda, 1985
Majer, V.; Svoboda, V.,
Enthalpies of Vaporization of Organic Compounds: A Critical Review and Data Compilation, Blackwell Scientific Publications, Oxford, 1985, 300. [all data]
Wiberg, 1952
Wiberg, K.B.,
J. Am. Chem. Soc., 1952, 74, 3891. [all data]
Dolliver, Gresham, et al., 1938
Dolliver, M.A.; Gresham, T.L.; Kistiakowsky, G.B.; Smith, E.A.; Vaughan, W.E.,
Heats of organic reactions. VI. Heats of hydrogenation of some oxygen-containing compounds,
J. Am. Chem. Soc., 1938, 60, 440-450. [all data]
Bowen and Maccoll, 1984
Bowen, R.D.; Maccoll, A.,
Low energy, low temperature mass spectra,
Org. Mass Spectrom., 1984, 19, 379. [all data]