1,2-Dimethyldiaziridine
- Formula: C3H8N2
- Molecular weight: 72.1090
- IUPAC Standard InChIKey: HHUSPFWAFUDXFF-UHFFFAOYSA-N
- CAS Registry Number: 6794-95-2
- Chemical structure:
View 3d structure (requires JavaScript / HTML 5) - Other names: Diaziridine,1,2-dimethyl-

Gas phase ion energetics data

Data compiled as indicated in comments:
LLK - Sharon G. Lias, Rhoda D. Levin, and Sherif A. Kafafi
Ionization energy determinations
IE (eV) | Method | Reference | Comment |
---|---|---|---|
9.42 | PE | Rademacher, 1974 | Vertical value; LLK |
9.42 | PE | Haselbach, Mannschreck, et al., 1973 | Vertical value; LLK |

References

Rademacher, 1974
Rademacher, P.,
Photoelectron spectra and conformation of cyclic N,N'-dimethylhydrazines,
Tetrahedron Lett., 1974, 83. [all data]
Haselbach, Mannschreck, et al., 1973
Haselbach, E.; Mannschreck, A.; Seitz, W.,
Lone pair electronic structure, conformation and oxidation behaviour of diaziridines,
Helv. Chim. Acta, 1973, 56, 1614. [all data]