5H-Pyrrolo[3,4-b]pyridine-5,7(6H)-dione,6-methyl-

Gas phase ion energetics data

Data compiled by: Sharon G. Lias, Rhoda D. Levin, and Sherif A. Kafafi

Ionization energy determinations

IE (eV) Method Reference Comment
9.8 ± 0.1PEBigotto, Galasso, et al., 1978Vertical value

References

Bigotto, Galasso, et al., 1978
Bigotto, A.; Galasso, V.; Colonna, F.P.; Distefano, G.; Pappalardo, G.C.; Scarlata, G., Electronic structure and photophysical properties of quinolinic anhydride, quinolinic thioanhydride, and N-methylquinolinimide, J. Chem. Soc. Perkin Trans. 2, 1978, 11, 1194. [all data]