1,2-Dioxetane
- Formula: C2H4O2
- Molecular weight: 60.0520
- IUPAC Standard InChIKey: BVTJGGGYKAMDBN-UHFFFAOYSA-N
- CAS Registry Number: 6788-84-7
- Chemical structure:
View 3d structure (requires JavaScript / HTML 5) - Permanent link for this species. Use this link for bookmarking this species for future reference.

Gas phase thermochemistry data

Data compiled by: Glushko Thermocenter, Russian Academy of Sciences, Moscow
Constant pressure heat capacity of gas
Cp,gas (J/mol*K) | Temperature (K) | Reference | Comment |
---|---|---|---|
33.29 | 50. | Dorofeeva O.V., 1992 | p=1 bar. |
34.71 | 100. | ||
37.62 | 150. | ||
42.20 | 200. | ||
52.51 | 273.15 | ||
56.7 ± 4.0 | 298.15 | ||
57.01 | 300. | ||
74.47 | 400. | ||
90.26 | 500. | ||
103.40 | 600. | ||
114.19 | 700. | ||
123.14 | 800. | ||
130.62 | 900. | ||
136.93 | 1000. | ||
142.29 | 1100. | ||
146.85 | 1200. | ||
150.76 | 1300. | ||
154.13 | 1400. | ||
157.02 | 1500. |

References

Dorofeeva O.V., 1992
Dorofeeva O.V.,
Ideal gas thermodynamic properties of oxygen heterocyclic compounds. Part 1. Three-membered, four-membered and five-membered rings,
Thermochim. Acta, 1992, 194, 9-46. [all data]