Pyridine, 2-[2-(2-iodophenyl)ethenyl]-, (E)-

Gas phase ion energetics data

Data compiled as indicated in comments:
LLK - Sharon G. Lias, Rhoda D. Levin, and Sherif A. Kafafi

Ionization energy determinations

IE (eV) Method Reference Comment
7.95EISchubert, Ramana, et al., 1980LLK

Appearance energy determinations

Ion AE (eV) Other Products MethodReferenceComment
C13H10N+8.9IEISchubert, Ramana, et al., 1980LLK

References

Schubert, Ramana, et al., 1980
Schubert, R.; Ramana, D.V.; Grutzmacher, H.-F., Freisetzung kinetischer energie und hammond-postulat bei der intramolekularen aromatischen substitution in 2-stilbazol-ionen, Chem. Ber., 1980, 113, 3758. [all data]