Pyridine, 2-(2-(chlorophenyl)vinyl) trans-
- Formula: C13H10ClN
- Molecular weight: 215.678
- IUPAC Standard InChIKey: YEZHQUGOABFELJ-CMDGGOBGSA-N
- CAS Registry Number: 6772-77-6
- Chemical structure:
View 3d structure (requires JavaScript / HTML 5) - Stereoisomers:

Gas phase ion energetics data

Data compiled as indicated in comments:
LLK - Sharon G. Lias, Rhoda D. Levin, and Sherif A. Kafafi
Ionization energy determinations
IE (eV) | Method | Reference | Comment |
---|---|---|---|
8.05 | EI | Schubert, Ramana, et al., 1980 | LLK |
Appearance energy determinations
Ion | AE (eV) | Other Products | Method | Reference | Comment |
---|---|---|---|---|---|
C13H10N+ | 9.2 | Cl | EI | Schubert, Ramana, et al., 1980 | LLK |

References

Schubert, Ramana, et al., 1980
Schubert, R.; Ramana, D.V.; Grutzmacher, H.-F.,
Freisetzung kinetischer energie und hammond-postulat bei der intramolekularen aromatischen substitution in 2-stilbazol-ionen,
Chem. Ber., 1980, 113, 3758. [all data]