Methyl dichlorophosphate
- Formula: CH3Cl2O2P
- Molecular weight: 148.913
- IUPAC Standard InChIKey: SNVCRNWSNUUGEA-UHFFFAOYSA-N
- CAS Registry Number: 677-24-7
- Chemical structure:
View 3d structure (requires JavaScript / HTML 5) - Other names: Methyl phosphorodichloridate; Phosphorodichloridic acid, methyl ester

Phase change data

Data compiled by: Robert L. Brown and Stephen E. Stein
Reduced pressure boiling point
Tboil (K) | Pressure (bar) | Reference |
---|---|---|
330. to 333. | 0.024 | Frinton Laboratories Inc., 1986 |

Gas phase ion energetics data

Data compiled by: Sharon G. Lias, Rhoda D. Levin, and Sherif A. Kafafi
Ionization energy determinations
IE (eV) | Method | Reference | Comment |
---|---|---|---|
11.50 | PE | Furlani and Andreocci, 1977 | Vertical value |

References

Frinton Laboratories Inc., 1986
Frinton Laboratories Inc.,
Catalog Number 11, Frinton Laboratories Inc., Vineland, NJ, 1986, 99. [all data]
Furlani and Andreocci, 1977
Furlani, C.; Andreocci, M.V.,
Valence-shell photoionization spectra of some methyldihalogenophosphates,
J. Chem. Soc. Dalton Trans., 1977, 7, 673. [all data]