Trimethylphosphine oxide
- Formula: C3H9OP
- Molecular weight: 92.0767
- IUPAC Standard InChIKey: LRMLWYXJORUTBG-UHFFFAOYSA-N
- CAS Registry Number: 676-96-0
- Chemical structure:
View 3d structure (requires JavaScript / HTML 5) - Other names: (CH3)3PO; Phosphine oxide, trimethyl-

Gas phase ion energetics data

Data evaluated as indicated in comments:
HL - Edward P. Hunter and Sharon G. Lias
Data compiled as indicated in comments:
LLK - Sharon G. Lias, Rhoda D. Levin, and Sherif A. Kafafi
Quantity | Value | Units | Method | Reference | Comment |
---|---|---|---|---|---|
Proton affinity (review) | 909.7 | kJ/mol | N/A | Hunter and Lias, 1998 | HL |
Quantity | Value | Units | Method | Reference | Comment |
Gas basicity | 880.0 | kJ/mol | N/A | Hunter and Lias, 1998 | HL |
Ionization energy determinations
IE (eV) | Method | Reference | Comment |
---|---|---|---|
9.88 | PE | Starzewski and Dieck, 1979 | Vertical value; LLK |
9.89 | PE | Starzewski, Richter, et al., 1976 | Vertical value; LLK |
9.9 | PE | Elbel and Dieck, 1976 | Vertical value; LLK |

References

Hunter and Lias, 1998
Hunter, E.P.; Lias, S.G.,
Evaluated Gas Phase Basicities and Proton Affinities of Molecules: An Update,
J. Phys. Chem. Ref. Data, 1998, 27, 3, 413-656, https://doi.org/10.1063/1.556018
. [all data]
Starzewski and Dieck, 1979
Starzewski, K.A.O.; Dieck, H.t.,
Electronic structure and reactivity. 8. Iminophosphoranes- simple ylide analogues? An investigation of quantitative and sphenomenological differences,
Inorg. Chem., 1979, 18, 3307. [all data]
Starzewski, Richter, et al., 1976
Starzewski, K.-H.A.O.; Richter, W.; Schmidbaur, H.,
Photoelektronenspektren und Struktur von Arsenyliden. P versus As: Ein Beitrag zur Problematik der ylidischen Bindung,
Chem. Ber., 1976, 109, 473. [all data]
Elbel and Dieck, 1976
Elbel, S.; Dieck, H.t.,
Photoelectron spectra of group 5 compounds. Part IV. A study of the E-X bond in R3EX compounds (R = Me or F; E = N or P; X = O or S),
J. Chem. Soc. Dalton Trans., 1976, 1757. [all data]