Dimethyl Sulfoxide
- Formula: C2H6OS
- Molecular weight: 78.133
- IUPAC Standard InChIKey: IAZDPXIOMUYVGZ-UHFFFAOYSA-N
- CAS Registry Number: 67-68-5
- Chemical structure:
View 3d structure (requires JavaScript / HTML 5) - Isotopologues:
- Other names: DMSO; Methane, sulfinylbis-; Methyl sulfoxide; Demsodrox; Dimexide; Dipirartril-tropico; Dolicur; Dromisol; Durasorb; DMS 70; DMS 90; Hyadur; Infiltrina; Somipront; Sulfinylbismethane; SQ 9453; Dimethyl sulphoxide; (CH3)2SO; A 10846; Deltan; Demasorb; Demavet; Demeso; Dermasorb; Doligur; Domoso; Gamasol 90; M 176; Methylsulfinylmethane; Rimso 50; Syntexan; NSC-763; Topsym; Dimethyl sulfur oxide; Herpid; Kemsol; Sclerosol; Sulfoxide, dimethyl; Methane, 1,1'-sulfinylbis-; DMSO (methyl sulfoxide); Sulphinylbis methane

Gas phase thermochemistry data

Data compiled by: Hussein Y. Afeefy, Joel F. Liebman, and Stephen E. Stein
Quantity | Value | Units | Method | Reference | Comment |
---|---|---|---|---|---|
ΔfH°gas | -150.5 ± 1.5 | kJ/mol | Ccr | Masuda, Nagano, et al., 1994 | H2SO4 (1:115 H2O) |

Condensed phase thermochemistry data

Data compiled as indicated in comments:
ALS - Hussein Y. Afeefy, Joel F. Liebman, and Stephen E. Stein
DH - Eugene S. Domalski and Elizabeth D. Hearing
Quantity | Value | Units | Method | Reference | Comment |
---|---|---|---|---|---|
ΔfH°liquid | -203.4 ± 1.4 | kJ/mol | Ccr | Masuda, Nagano, et al., 1994 | H2SO4 (1:115 H2O); ALS |
Quantity | Value | Units | Method | Reference | Comment |
ΔcH°liquid | -2037.3 ± 1.3 | kJ/mol | Ccr | Masuda, Nagano, et al., 1994 | H2SO4 (1:115 H2O); ALS |
Quantity | Value | Units | Method | Reference | Comment |
S°liquid | 188.78 | J/mol*K | N/A | Clever and Westrum, 1970 | DH |
Constant pressure heat capacity of liquid
Cp,liquid (J/mol*K) | Temperature (K) | Reference | Comment |
---|---|---|---|
149.39 | 298.15 | Grolier, Roux-Desgranges, et al., 1993 | DH |
148.28 | 298.15 | Barta, Kooner, et al., 1989 | DH |
153.6 | 298.15 | Rodante and Marrosu, 1988 | DH |
153.2 | 298.15 | Lankford and Criss, 1987 | DH |
155.9 | 298.15 | de Visser and Somsen, 1979 | DH |
155.9 | 298.15 | De Visser, Heuvelsland, et al., 1978 | DH |
153.18 | 298.15 | Clever and Westrum, 1970 | T = 5 to 350 K.; DH |
149.0 | 298.15 | Kenttmaa and Lindberg, 1960 | T = 298, 343 K.; DH |

Phase change data

Data compiled as indicated in comments:
TRC - Thermodynamics Research Center, NIST Boulder Laboratories, Chris Muzny director
ALS - Hussein Y. Afeefy, Joel F. Liebman, and Stephen E. Stein
AC - William E. Acree, Jr., James S. Chickos
DH - Eugene S. Domalski and Elizabeth D. Hearing
Quantity | Value | Units | Method | Reference | Comment |
---|---|---|---|---|---|
Tboil | 463. ± 1. | K | AVG | N/A | Average of 6 values; Individual data points |
Quantity | Value | Units | Method | Reference | Comment |
Tfus | 291.65 | K | N/A | Lindberg and Stenholm, 1966 | Uncertainty assigned by TRC = 0.4 K; TRC |
Tfus | 291.57 | K | N/A | Douglas, 1948 | Uncertainty assigned by TRC = 0.2 K; TRC |
Tfus | 291.65 | K | N/A | Douglas, 1946 | Uncertainty assigned by TRC = 0.2 K; TRC |
Quantity | Value | Units | Method | Reference | Comment |
Ttriple | 291.59 | K | N/A | Clever and Westrum, 1970, 2 | Uncertainty assigned by TRC = 0.1 K; TRC |
Ttriple | 291.67 | K | N/A | Clever and Westrum, 1970, 2 | Uncertainty assigned by TRC = 0.06 K; TRC |
Quantity | Value | Units | Method | Reference | Comment |
ΔvapH° | 52.9 ± 0.4 | kJ/mol | V | Douglas, 1948, 2 | ALS |
ΔvapH° | 52.9 ± 0.4 | kJ/mol | RG | Douglas, 1948, 3 | Based on data from 293. to 323. K.; AC |
Enthalpy of vaporization
ΔvapH (kJ/mol) | Temperature (K) | Method | Reference | Comment |
---|---|---|---|---|
48.1 | 368. | TGA | Al-Najjar and Al-Sammerrai, 2007 | Based on data from 353. to 383. K.; AC |
48.6 | 392. | N/A | Dykyj, Svoboda, et al., 1999 | Based on data from 377. to 483. K.; AC |
51.7 | 320. | A | Stephenson and Malanowski, 1987 | Based on data from 305. to 464. K.; AC |
52.3 | 308. | N/A | Sassa, Konishi, et al., 1974 | Based on data from 298. to 318. K.; AC |
50.6 | 340. | MM | Jakli and Alexander Van Hook, 1972 | Based on data from 325. to 442. K. See also Boublik, Fried, et al., 1984.; AC |
52.1 | 318. | N/A | NISHIMURA, NAKAYAMA, et al., 1972 | Based on data from 303. to 423. K.; AC |
52.5 | 308. | N/A | Meszaros, 1969 | Based on data from 293. to 323. K.; AC |
Antoine Equation Parameters
log10(P) = A − (B / (T + C))
P = vapor pressure (bar)
T = temperature (K)
View plot Requires a JavaScript / HTML 5 canvas capable browser.
Temperature (K) | A | B | C | Reference | Comment |
---|---|---|---|---|---|
325.49 to 442.09 | 4.49107 | 1807.002 | -60.995 | Jakli and van Hook, 1972 | Coefficents calculated by NIST from author's data. |
293. to 323. | 5.23039 | 2239.161 | -29.215 | Douglas, 1948, 3 | Coefficents calculated by NIST from author's data. |
Enthalpy of fusion
ΔfusH (kJ/mol) | Temperature (K) | Reference | Comment |
---|---|---|---|
14.368 | 291.67 | Clever and Westrum, 1970 | DH |
14.37 | 291.7 | Domalski and Hearing, 1996 | AC |
Entropy of fusion
ΔfusS (J/mol*K) | Temperature (K) | Reference | Comment |
---|---|---|---|
49.26 | 291.67 | Clever and Westrum, 1970 | DH |

Reaction thermochemistry data

Data compiled as indicated in comments:
B - John E. Bartmess
M - Michael M. Meot-Ner (Mautner) and Sharon G. Lias
RCD - Robert C. Dunbar
ALS - Hussein Y. Afeefy, Joel F. Liebman, and Stephen E. Stein
Individual Reactions
C2H5OS- + =
By formula: C2H5OS- + H+ = C2H6OS
Quantity | Value | Units | Method | Reference | Comment |
---|---|---|---|---|---|
ΔrH° | 1563. ± 8.8 | kJ/mol | G+TS | Bartmess, Scott, et al., 1979 | gas phase; value altered from reference due to change in acidity scale; B |
ΔrH° | 1566. ± 9.6 | kJ/mol | G+TS | Cumming and Kebarle, 1978 | gas phase; B |
Quantity | Value | Units | Method | Reference | Comment |
ΔrG° | 1533. ± 8.4 | kJ/mol | IMRE | Bartmess, Scott, et al., 1979 | gas phase; value altered from reference due to change in acidity scale; B |
ΔrG° | 1536. ± 8.4 | kJ/mol | IMRE | Cumming and Kebarle, 1978 | gas phase; B |
By formula: NO2- + C2H6OS = (NO2- • C2H6OS)
Quantity | Value | Units | Method | Reference | Comment |
---|---|---|---|---|---|
ΔrH° | 80.3 ± 4.2 | kJ/mol | TDAs | Sieck, 1985 | gas phase; B,M |
Quantity | Value | Units | Method | Reference | Comment |
ΔrS° | 100. | J/mol*K | N/A | Sieck, 1985 | gas phase; Entropy change calculated or estimated; M |
Quantity | Value | Units | Method | Reference | Comment |
ΔrG° | 36. ± 4.2 | kJ/mol | TDAs | Sieck, 1985 | gas phase; B |
Free energy of reaction
ΔrG° (kJ/mol) | T (K) | Method | Reference | Comment |
---|---|---|---|---|
36. | 420. | PHPMS | Sieck, 1985 | gas phase; Entropy change calculated or estimated; M |
By formula: C6H5NO2- + C2H6OS = (C6H5NO2- • C2H6OS)
Quantity | Value | Units | Method | Reference | Comment |
---|---|---|---|---|---|
ΔrH° | 70.29 ± 0.42 | kJ/mol | TDAs | Sieck, 1985 | gas phase; B,M |
Quantity | Value | Units | Method | Reference | Comment |
ΔrS° | 103. | J/mol*K | PHPMS | Sieck, 1985 | gas phase; M |
Quantity | Value | Units | Method | Reference | Comment |
ΔrG° | 39.7 ± 0.84 | kJ/mol | TDAs | Sieck, 1985 | gas phase; B |
ΔrG° | 36. ± 6.7 | kJ/mol | IMRE | Chowdhury, Grimsrud, et al., 1987 | gas phase; Free energy affinity at 70°C.; B |
By formula: C7H7NO3- + C2H6OS = (C7H7NO3- • C2H6OS)
Quantity | Value | Units | Method | Reference | Comment |
---|---|---|---|---|---|
ΔrH° | 68.2 ± 8.4 | kJ/mol | N/A | Chowdhury, Grimsrud, et al., 1987 | gas phase; Free energy affinity at 70°C.; B,M |
Quantity | Value | Units | Method | Reference | Comment |
ΔrS° | 94.1 | J/mol*K | PHPMS | Chowdhury, 1987 | gas phase; M |
Quantity | Value | Units | Method | Reference | Comment |
ΔrG° | 35. ± 8.4 | kJ/mol | TDAs | Chowdhury, Grimsrud, et al., 1987 | gas phase; Free energy affinity at 70°C.; B |
By formula: Br- + C2H6OS = (Br- • C2H6OS)
Quantity | Value | Units | Method | Reference | Comment |
---|---|---|---|---|---|
ΔrH° | 72.38 | kJ/mol | TDAs | Magnera, Caldwell, et al., 1984 | gas phase; B,M |
ΔrH° | 72.0 | kJ/mol | HPMS | Caldwell, Masucci, et al., 1989 | gas phase; M |
Quantity | Value | Units | Method | Reference | Comment |
ΔrS° | 89.5 | J/mol*K | PHPMS | Magnera, Caldwell, et al., 1984 | gas phase; M |
Quantity | Value | Units | Method | Reference | Comment |
ΔrG° | 45.61 | kJ/mol | TDAs | Magnera, Caldwell, et al., 1984 | gas phase; B |
By formula: I- + C2H6OS = (I- • C2H6OS)
Quantity | Value | Units | Method | Reference | Comment |
---|---|---|---|---|---|
ΔrH° | 65.69 | kJ/mol | TDAs | Magnera, Caldwell, et al., 1984 | gas phase; B,M |
ΔrH° | 67. | kJ/mol | PHPMS | Caldwell, Masucci, et al., 1989 | gas phase; M |
Quantity | Value | Units | Method | Reference | Comment |
ΔrS° | 90.8 | J/mol*K | PHPMS | Magnera, Caldwell, et al., 1984 | gas phase; M |
Quantity | Value | Units | Method | Reference | Comment |
ΔrG° | 38.5 | kJ/mol | TDAs | Magnera, Caldwell, et al., 1984 | gas phase; B |
C7H4F3NO2- + = (C7H4F3NO2- •
)
By formula: C7H4F3NO2- + C2H6OS = (C7H4F3NO2- • C2H6OS)
Quantity | Value | Units | Method | Reference | Comment |
---|---|---|---|---|---|
ΔrH° | 61.1 ± 8.4 | kJ/mol | N/A | Chowdhury, Grimsrud, et al., 1987 | gas phase; Free energy affinity at 70°C.; B,M |
Quantity | Value | Units | Method | Reference | Comment |
ΔrS° | 93.3 | J/mol*K | PHPMS | Chowdhury, 1987 | gas phase; M |
Quantity | Value | Units | Method | Reference | Comment |
ΔrG° | 30. ± 8.4 | kJ/mol | TDAs | Chowdhury, Grimsrud, et al., 1987 | gas phase; Free energy affinity at 70°C.; B |
By formula: Cl- + C2H6OS = (Cl- • C2H6OS)
Quantity | Value | Units | Method | Reference | Comment |
---|---|---|---|---|---|
ΔrH° | 77.82 | kJ/mol | TDAs | Magnera, Caldwell, et al., 1984 | gas phase; B,M |
Quantity | Value | Units | Method | Reference | Comment |
ΔrS° | 85.4 | J/mol*K | PHPMS | Magnera, Caldwell, et al., 1984 | gas phase; M |
Quantity | Value | Units | Method | Reference | Comment |
ΔrG° | 52.30 | kJ/mol | TDAs | Magnera, Caldwell, et al., 1984 | gas phase; B |
By formula: C2H7OS+ + C2H6OS = (C2H7OS+ • C2H6OS)
Quantity | Value | Units | Method | Reference | Comment |
---|---|---|---|---|---|
ΔrH° | 129. | kJ/mol | PHPMS | Lau, Saluja, et al., 1980 | gas phase; switching reaction((CH3)2SOH+)(CH3)2CO; M |
Quantity | Value | Units | Method | Reference | Comment |
ΔrS° | 95.8 | J/mol*K | PHPMS | Lau, Saluja, et al., 1980 | gas phase; switching reaction((CH3)2SOH+)(CH3)2CO; M |
(C2H7OS+ • ) +
= (C2H7OS+ • 2
)
By formula: (C2H7OS+ • C2H6OS) + C2H6OS = (C2H7OS+ • 2C2H6OS)
Quantity | Value | Units | Method | Reference | Comment |
---|---|---|---|---|---|
ΔrH° | 89.1 | kJ/mol | PHPMS | Lau, Saluja, et al., 1980 | gas phase; Entropy change is questionable; M |
Quantity | Value | Units | Method | Reference | Comment |
ΔrS° | 45.6 | J/mol*K | PHPMS | Lau, Saluja, et al., 1980 | gas phase; Entropy change is questionable; M |
By formula: (K+ • 4C2H6OS) + C2H6OS = (K+ • 5C2H6OS)
Quantity | Value | Units | Method | Reference | Comment |
---|---|---|---|---|---|
ΔrH° | 66.1 | kJ/mol | HPMS | Sunner, 1984 | gas phase; Entropy change is questionable; M |
Quantity | Value | Units | Method | Reference | Comment |
ΔrS° | 150. | J/mol*K | HPMS | Sunner, 1984 | gas phase; Entropy change is questionable; M |
By formula: (K+ • 5C2H6OS) + C2H6OS = (K+ • 6C2H6OS)
Quantity | Value | Units | Method | Reference | Comment |
---|---|---|---|---|---|
ΔrH° | 64.9 | kJ/mol | HPMS | Sunner, 1984 | gas phase; Entropy change is questionable; M |
Quantity | Value | Units | Method | Reference | Comment |
ΔrS° | 170. | J/mol*K | HPMS | Sunner, 1984 | gas phase; Entropy change is questionable; M |
By formula: C6H4FNO2- + C2H6OS = (C6H4FNO2- • C2H6OS)
Quantity | Value | Units | Method | Reference | Comment |
---|---|---|---|---|---|
ΔrG° | 33. ± 6.7 | kJ/mol | IMRE | Chowdhury, Grimsrud, et al., 1987 | gas phase; Free energy affinity at 70°C.; B |
Free energy of reaction
ΔrG° (kJ/mol) | T (K) | Method | Reference | Comment |
---|---|---|---|---|
33. | 343. | PHPMS | Chowdhury, 1987 | gas phase; M |
By formula: C6H4FNO2- + C2H6OS = (C6H4FNO2- • C2H6OS)
Quantity | Value | Units | Method | Reference | Comment |
---|---|---|---|---|---|
ΔrG° | 34. ± 6.7 | kJ/mol | IMRE | Chowdhury, Grimsrud, et al., 1987 | gas phase; Free energy affinity at 70°C.; B |
Free energy of reaction
ΔrG° (kJ/mol) | T (K) | Method | Reference | Comment |
---|---|---|---|---|
34. | 343. | PHPMS | Chowdhury, 1987 | gas phase; M |
C6H4ClNO2- + = (C6H4ClNO2- •
)
By formula: C6H4ClNO2- + C2H6OS = (C6H4ClNO2- • C2H6OS)
Quantity | Value | Units | Method | Reference | Comment |
---|---|---|---|---|---|
ΔrG° | 31. ± 6.7 | kJ/mol | IMRE | Chowdhury, Grimsrud, et al., 1987 | gas phase; Free energy affinity at 70°C.; B |
Free energy of reaction
ΔrG° (kJ/mol) | T (K) | Method | Reference | Comment |
---|---|---|---|---|
31. | 343. | PHPMS | Chowdhury, 1987 | gas phase; M |
By formula: C6H4FNO2- + C2H6OS = (C6H4FNO2- • C2H6OS)
Quantity | Value | Units | Method | Reference | Comment |
---|---|---|---|---|---|
ΔrG° | 33. ± 6.7 | kJ/mol | IMRE | Chowdhury, Grimsrud, et al., 1987 | gas phase; Free energy affinity at 70°C.; B |
Free energy of reaction
ΔrG° (kJ/mol) | T (K) | Method | Reference | Comment |
---|---|---|---|---|
33. | 343. | PHPMS | Chowdhury, 1987 | gas phase; M |
C6H4ClNO2- + = (C6H4ClNO2- •
)
By formula: C6H4ClNO2- + C2H6OS = (C6H4ClNO2- • C2H6OS)
Quantity | Value | Units | Method | Reference | Comment |
---|---|---|---|---|---|
ΔrG° | 33. ± 6.7 | kJ/mol | IMRE | Chowdhury, Grimsrud, et al., 1987 | gas phase; Free energy affinity at 70°C.; B |
Free energy of reaction
ΔrG° (kJ/mol) | T (K) | Method | Reference | Comment |
---|---|---|---|---|
33. | 343. | PHPMS | Chowdhury, 1987 | gas phase; M |
C6H4ClNO2- + = (C6H4ClNO2- •
)
By formula: C6H4ClNO2- + C2H6OS = (C6H4ClNO2- • C2H6OS)
Quantity | Value | Units | Method | Reference | Comment |
---|---|---|---|---|---|
ΔrG° | 32. ± 6.7 | kJ/mol | IMRE | Chowdhury, Grimsrud, et al., 1987 | gas phase; Free energy affinity at 70°C.; B |
Free energy of reaction
ΔrG° (kJ/mol) | T (K) | Method | Reference | Comment |
---|---|---|---|---|
32. | 343. | PHPMS | Chowdhury, 1987 | gas phase; M |
By formula: C6H4N2O4- + C2H6OS = (C6H4N2O4- • C2H6OS)
Quantity | Value | Units | Method | Reference | Comment |
---|---|---|---|---|---|
ΔrG° | 18. ± 6.7 | kJ/mol | IMRE | Chowdhury, Grimsrud, et al., 1987 | gas phase; Free energy affinity at 70°C.; B |
Free energy of reaction
ΔrG° (kJ/mol) | T (K) | Method | Reference | Comment |
---|---|---|---|---|
18. | 343. | PHPMS | Chowdhury, 1987 | gas phase; M |
By formula: C6H4N2O4- + C2H6OS = (C6H4N2O4- • C2H6OS)
Quantity | Value | Units | Method | Reference | Comment |
---|---|---|---|---|---|
ΔrG° | 26. ± 6.7 | kJ/mol | IMRE | Chowdhury, Grimsrud, et al., 1987 | gas phase; Free energy affinity at 70°C.; B |
Free energy of reaction
ΔrG° (kJ/mol) | T (K) | Method | Reference | Comment |
---|---|---|---|---|
26. | 343. | PHPMS | Chowdhury, 1987 | gas phase; M |
By formula: C6H4N2O4- + C2H6OS = (C6H4N2O4- • C2H6OS)
Quantity | Value | Units | Method | Reference | Comment |
---|---|---|---|---|---|
ΔrG° | 25. ± 6.7 | kJ/mol | IMRE | Chowdhury, Grimsrud, et al., 1987 | gas phase; Free energy affinity at 70°C.; B |
Free energy of reaction
ΔrG° (kJ/mol) | T (K) | Method | Reference | Comment |
---|---|---|---|---|
25. | 343. | PHPMS | Chowdhury, 1987 | gas phase; M |
By formula: C7H7NO2- + C2H6OS = (C7H7NO2- • C2H6OS)
Quantity | Value | Units | Method | Reference | Comment |
---|---|---|---|---|---|
ΔrG° | 36. ± 6.7 | kJ/mol | IMRE | Chowdhury, Grimsrud, et al., 1987 | gas phase; Free energy affinity at 70°C.; B |
Free energy of reaction
ΔrG° (kJ/mol) | T (K) | Method | Reference | Comment |
---|---|---|---|---|
36. | 343. | PHPMS | Chowdhury, 1987 | gas phase; M |
By formula: C6F4O2- + C2H6OS = (C6F4O2- • C2H6OS)
Quantity | Value | Units | Method | Reference | Comment |
---|---|---|---|---|---|
ΔrG° | 19. ± 6.7 | kJ/mol | IMRE | Chowdhury, Grimsrud, et al., 1987 | gas phase; Free energy affinity at 70°C.; B |
Free energy of reaction
ΔrG° (kJ/mol) | T (K) | Method | Reference | Comment |
---|---|---|---|---|
19. | 343. | PHPMS | Chowdhury, 1987 | gas phase; M |
By formula: C6H4O2- + C2H6OS = (C6H4O2- • C2H6OS)
Quantity | Value | Units | Method | Reference | Comment |
---|---|---|---|---|---|
ΔrG° | 26. ± 6.7 | kJ/mol | IMRE | Chowdhury, Grimsrud, et al., 1987 | gas phase; Free energy affinity at 70°C.; B |
Free energy of reaction
ΔrG° (kJ/mol) | T (K) | Method | Reference | Comment |
---|---|---|---|---|
26. | 343. | PHPMS | Chowdhury, 1987 | gas phase; M |
By formula: C7H4N2O2- + C2H6OS = (C7H4N2O2- • C2H6OS)
Quantity | Value | Units | Method | Reference | Comment |
---|---|---|---|---|---|
ΔrG° | 28. ± 6.7 | kJ/mol | IMRE | Chowdhury, Grimsrud, et al., 1987 | gas phase; Free energy affinity at 70°C.; B |
Free energy of reaction
ΔrG° (kJ/mol) | T (K) | Method | Reference | Comment |
---|---|---|---|---|
28. | 343. | PHPMS | Chowdhury, 1987 | gas phase; M |
By formula: K+ + C2H6OS = (K+ • C2H6OS)
Quantity | Value | Units | Method | Reference | Comment |
---|---|---|---|---|---|
ΔrH° | 130. | kJ/mol | CIDT | Klassen, Anderson, et al., 1996 | RCD |
ΔrH° | 150. | kJ/mol | HPMS | Sunner, 1984 | gas phase; M |
Quantity | Value | Units | Method | Reference | Comment |
ΔrS° | 130. | J/mol*K | HPMS | Sunner, 1984 | gas phase; M |
By formula: C4H2O3- + C2H6OS = (C4H2O3- • C2H6OS)
Quantity | Value | Units | Method | Reference | Comment |
---|---|---|---|---|---|
ΔrG° | 28. ± 6.7 | kJ/mol | IMRE | Chowdhury, Grimsrud, et al., 1987 | gas phase; Free energy affinity at 70°C.; B |
Free energy of reaction
ΔrG° (kJ/mol) | T (K) | Method | Reference | Comment |
---|---|---|---|---|
28. | 343. | PHPMS | Chowdhury, 1987 | gas phase; M |
By formula: C7H4N2O2- + C2H6OS = (C7H4N2O2- • C2H6OS)
Quantity | Value | Units | Method | Reference | Comment |
---|---|---|---|---|---|
ΔrG° | 28. ± 6.7 | kJ/mol | IMRE | Chowdhury, Grimsrud, et al., 1987 | gas phase; Free energy affinity at 70°C.; B |
Free energy of reaction
ΔrG° (kJ/mol) | T (K) | Method | Reference | Comment |
---|---|---|---|---|
28. | 343. | PHPMS | Chowdhury, 1987 | gas phase; M |
By formula: 2C2H6S + O2 = 2C2H6OS
Quantity | Value | Units | Method | Reference | Comment |
---|---|---|---|---|---|
ΔrH° | -277.7 ± 0.84 | kJ/mol | Cm | Douglas, 1946, 2 | liquid phase; Reanalyzed by Cox and Pilcher, 1970, Original value = -278.3 ± 0.8 kJ/mol; At 291°K; ALS |
By formula: C2H6O2S = C2H6OS + 0.5O2
Quantity | Value | Units | Method | Reference | Comment |
---|---|---|---|---|---|
ΔrH° | 243.3 ± 0.84 | kJ/mol | Cm | Douglas, 1946, 2 | liquid phase; Reanalyzed by Cox and Pilcher, 1970, Original value = 246.9 ± 0.8 kJ/mol; At 291°K; ALS |
By formula: (Cl- • 2C2H6OS) + C2H6OS = (Cl- • 3C2H6OS)
Quantity | Value | Units | Method | Reference | Comment |
---|---|---|---|---|---|
ΔrH° | 62.3 | kJ/mol | PHPMS | Magnera, Caldwell, et al., 1984 | gas phase; M |
Quantity | Value | Units | Method | Reference | Comment |
ΔrS° | 125. | J/mol*K | PHPMS | Magnera, Caldwell, et al., 1984 | gas phase; M |
By formula: (Cl- • 3C2H6OS) + C2H6OS = (Cl- • 4C2H6OS)
Quantity | Value | Units | Method | Reference | Comment |
---|---|---|---|---|---|
ΔrH° | 61.1 | kJ/mol | PHPMS | Magnera, Caldwell, et al., 1984 | gas phase; M |
Quantity | Value | Units | Method | Reference | Comment |
ΔrS° | 156. | J/mol*K | PHPMS | Magnera, Caldwell, et al., 1984 | gas phase; M |
By formula: (Cl- • 4C2H6OS) + C2H6OS = (Cl- • 5C2H6OS)
Quantity | Value | Units | Method | Reference | Comment |
---|---|---|---|---|---|
ΔrH° | 57.7 | kJ/mol | PHPMS | Magnera, Caldwell, et al., 1984 | gas phase; M |
Quantity | Value | Units | Method | Reference | Comment |
ΔrS° | 168. | J/mol*K | PHPMS | Magnera, Caldwell, et al., 1984 | gas phase; M |
By formula: (I- • 2C2H6OS) + C2H6OS = (I- • 3C2H6OS)
Quantity | Value | Units | Method | Reference | Comment |
---|---|---|---|---|---|
ΔrH° | 48.5 | kJ/mol | PHPMS | Magnera, Caldwell, et al., 1984 | gas phase; M |
Quantity | Value | Units | Method | Reference | Comment |
ΔrS° | 105. | J/mol*K | PHPMS | Magnera, Caldwell, et al., 1984 | gas phase; M |
By formula: (Br- • 2C2H6OS) + C2H6OS = (Br- • 3C2H6OS)
Quantity | Value | Units | Method | Reference | Comment |
---|---|---|---|---|---|
ΔrH° | 56.9 | kJ/mol | PHPMS | Magnera, Caldwell, et al., 1984 | gas phase; M |
Quantity | Value | Units | Method | Reference | Comment |
ΔrS° | 115. | J/mol*K | PHPMS | Magnera, Caldwell, et al., 1984 | gas phase; M |
By formula: (Cl- • C2H6OS) + C2H6OS = (Cl- • 2C2H6OS)
Quantity | Value | Units | Method | Reference | Comment |
---|---|---|---|---|---|
ΔrH° | 66.9 | kJ/mol | PHPMS | Magnera, Caldwell, et al., 1984 | gas phase; M |
Quantity | Value | Units | Method | Reference | Comment |
ΔrS° | 99.6 | J/mol*K | PHPMS | Magnera, Caldwell, et al., 1984 | gas phase; M |
By formula: (I- • C2H6OS) + C2H6OS = (I- • 2C2H6OS)
Quantity | Value | Units | Method | Reference | Comment |
---|---|---|---|---|---|
ΔrH° | 53.6 | kJ/mol | PHPMS | Magnera, Caldwell, et al., 1984 | gas phase; M |
Quantity | Value | Units | Method | Reference | Comment |
ΔrS° | 92.0 | J/mol*K | PHPMS | Magnera, Caldwell, et al., 1984 | gas phase; M |
By formula: (Br- • C2H6OS) + C2H6OS = (Br- • 2C2H6OS)
Quantity | Value | Units | Method | Reference | Comment |
---|---|---|---|---|---|
ΔrH° | 60.7 | kJ/mol | PHPMS | Magnera, Caldwell, et al., 1984 | gas phase; M |
Quantity | Value | Units | Method | Reference | Comment |
ΔrS° | 93.7 | J/mol*K | PHPMS | Magnera, Caldwell, et al., 1984 | gas phase; M |
By formula: Na+ + C2H6OS = (Na+ • C2H6OS)
Quantity | Value | Units | Method | Reference | Comment |
---|---|---|---|---|---|
ΔrH° | 130. | kJ/mol | CID | Klassen, Anderson, et al., 1996 | RCD |
Free energy of reaction
ΔrG° (kJ/mol) | T (K) | Method | Reference | Comment |
---|---|---|---|---|
130. | 298. | IMRE | McMahon and Ohanessian, 2000 | Anchor alanine=39.89; RCD |
By formula: (K+ • 2C2H6OS) + C2H6OS = (K+ • 3C2H6OS)
Quantity | Value | Units | Method | Reference | Comment |
---|---|---|---|---|---|
ΔrH° | 84. | kJ/mol | HPMS | Sunner, 1984 | gas phase; M |
Quantity | Value | Units | Method | Reference | Comment |
ΔrS° | 120. | J/mol*K | HPMS | Sunner, 1984 | gas phase; M |
By formula: (K+ • 3C2H6OS) + C2H6OS = (K+ • 4C2H6OS)
Quantity | Value | Units | Method | Reference | Comment |
---|---|---|---|---|---|
ΔrH° | 67. | kJ/mol | HPMS | Sunner, 1984 | gas phase; M |
Quantity | Value | Units | Method | Reference | Comment |
ΔrS° | 130. | J/mol*K | HPMS | Sunner, 1984 | gas phase; M |
By formula: (K+ • C2H6OS) + C2H6OS = (K+ • 2C2H6OS)
Quantity | Value | Units | Method | Reference | Comment |
---|---|---|---|---|---|
ΔrH° | 120. | kJ/mol | HPMS | Sunner, 1984 | gas phase; M |
Quantity | Value | Units | Method | Reference | Comment |
ΔrS° | 140. | J/mol*K | HPMS | Sunner, 1984 | gas phase; M |
By formula: C7H4N2O2- + C2H6OS = (C7H4N2O2- • C2H6OS)
Quantity | Value | Units | Method | Reference | Comment |
---|---|---|---|---|---|
ΔrH° | 66.9 | kJ/mol | PHPMS | Chowdhury, 1987 | gas phase; M |
Quantity | Value | Units | Method | Reference | Comment |
ΔrS° | 141. | J/mol*K | PHPMS | Chowdhury, 1987 | gas phase; M |
By formula: C6H4NO3- + C2H6OS = (C6H4NO3- • C2H6OS)
Quantity | Value | Units | Method | Reference | Comment |
---|---|---|---|---|---|
ΔrG° | 31. ± 6.7 | kJ/mol | IMRE | Chowdhury, Grimsrud, et al., 1987 | gas phase; Free energy affinity at 70°C.; B |
By formula: C6H4NO3- + C2H6OS = (C6H4NO3- • C2H6OS)
Quantity | Value | Units | Method | Reference | Comment |
---|---|---|---|---|---|
ΔrG° | 25. ± 6.7 | kJ/mol | IMRE | Chowdhury, Grimsrud, et al., 1987 | gas phase; Free energy affinity at 70°C.; B |
+
= C12H12O3S-
By formula: C10H6O2- + C2H6OS = C12H12O3S-
Quantity | Value | Units | Method | Reference | Comment |
---|---|---|---|---|---|
ΔrG° | 24. ± 6.7 | kJ/mol | IMRE | Chowdhury, Grimsrud, et al., 1987 | gas phase; Free energy affinity at 70°C.; B |
By formula: F6S- + C2H6OS = (F6S- • C2H6OS)
Free energy of reaction
ΔrG° (kJ/mol) | T (K) | Method | Reference | Comment |
---|---|---|---|---|
30. | 308. | PHPMS | Knighton, Zook, et al., 1990 | gas phase; M |
By formula: C7F14- + C2H6OS = (C7F14- • C2H6OS)
Free energy of reaction
ΔrG° (kJ/mol) | T (K) | Method | Reference | Comment |
---|---|---|---|---|
32. | 308. | PHPMS | Knighton, Zook, et al., 1990 | gas phase; M |
By formula: C10H6O2- + C2H6OS = (C10H6O2- • C2H6OS)
Free energy of reaction
ΔrG° (kJ/mol) | T (K) | Method | Reference | Comment |
---|---|---|---|---|
24. | 343. | PHPMS | Chowdhury, 1987 | gas phase; M |

Henry's Law data

Data compiled by: Rolf Sander
Henry's Law constant (water solution)
kH(T) = k°H exp(d(ln(kH))/d(1/T) ((1/T) - 1/(298.15 K)))
k°H = Henry's law constant for solubility in water at 298.15 K (mol/(kg*bar))
d(ln(kH))/d(1/T) = Temperature dependence constant (K)
k°H (mol/(kg*bar)) | d(ln(kH))/d(1/T) (K) | Method | Reference | Comment |
---|---|---|---|---|
>50000. | C | N/A | ||
1400. | X | N/A | Value given here as quoted by missing citation. |

Gas phase ion energetics data

Data evaluated as indicated in comments:
HL - Edward P. Hunter and Sharon G. Lias
Data compiled as indicated in comments:
B - John E. Bartmess
LLK - Sharon G. Lias, Rhoda D. Levin, and Sherif A. Kafafi
RDSH - Henry M. Rosenstock, Keith Draxl, Bruce W. Steiner, and John T. Herron
LL - Sharon G. Lias and Joel F. Liebman
Quantity | Value | Units | Method | Reference | Comment |
---|---|---|---|---|---|
Proton affinity (review) | 884.4 | kJ/mol | N/A | Hunter and Lias, 1998 | HL |
Quantity | Value | Units | Method | Reference | Comment |
Gas basicity | 853.7 | kJ/mol | N/A | Hunter and Lias, 1998 | HL |
Electron affinity determinations
EA (eV) | Method | Reference | Comment |
---|---|---|---|
0.013921 ± 0.000087 | N/A | Hammer, Diri, et al., 2003 | B |
0.007416 | EFD | Suess, Liu, et al., 2003 | B |
Ionization energy determinations
IE (eV) | Method | Reference | Comment |
---|---|---|---|
9.10 | PE | Kimura, Katsumata, et al., 1981 | LLK |
9.08 ± 0.09 | EI | Potzinger, Stracke, et al., 1975 | LLK |
9.20 ± 0.05 | EI | Distefano, Foffani, et al., 1971 | LLK |
9.20 | EI | Distefano, Foffani, et al., 1971, 2 | LLK |
9.9 ± 0.1 | EI | Blais, Cottin, et al., 1970 | RDSH |
9.10 | PE | Kimura, Katsumata, et al., 1981 | Vertical value; LLK |
9.01 | PE | Bock and Solouki, 1974 | Vertical value; LLK |
9.11 | PE | Mines, Thomas, et al., 1972 | Vertical value; LLK |
9.01 | PE | Bock and Solouki, 1972 | Vertical value; LLK |
Appearance energy determinations
De-protonation reactions
C2H5OS- + =
By formula: C2H5OS- + H+ = C2H6OS
Quantity | Value | Units | Method | Reference | Comment |
---|---|---|---|---|---|
ΔrH° | 1563. ± 8.8 | kJ/mol | G+TS | Bartmess, Scott, et al., 1979 | gas phase; value altered from reference due to change in acidity scale; B |
ΔrH° | 1566. ± 9.6 | kJ/mol | G+TS | Cumming and Kebarle, 1978 | gas phase; B |
Quantity | Value | Units | Method | Reference | Comment |
ΔrG° | 1533. ± 8.4 | kJ/mol | IMRE | Bartmess, Scott, et al., 1979 | gas phase; value altered from reference due to change in acidity scale; B |
ΔrG° | 1536. ± 8.4 | kJ/mol | IMRE | Cumming and Kebarle, 1978 | gas phase; B |

Ion clustering data

Data compiled as indicated in comments:
B - John E. Bartmess
M - Michael M. Meot-Ner (Mautner) and Sharon G. Lias
RCD - Robert C. Dunbar
Clustering reactions
By formula: Br- + C2H6OS = (Br- • C2H6OS)
Quantity | Value | Units | Method | Reference | Comment |
---|---|---|---|---|---|
ΔrH° | 72.38 | kJ/mol | TDAs | Magnera, Caldwell, et al., 1984 | gas phase; B,M |
ΔrH° | 72.0 | kJ/mol | HPMS | Caldwell, Masucci, et al., 1989 | gas phase; M |
Quantity | Value | Units | Method | Reference | Comment |
ΔrS° | 89.5 | J/mol*K | PHPMS | Magnera, Caldwell, et al., 1984 | gas phase; M |
Quantity | Value | Units | Method | Reference | Comment |
ΔrG° | 45.61 | kJ/mol | TDAs | Magnera, Caldwell, et al., 1984 | gas phase; B |
By formula: (Br- • C2H6OS) + C2H6OS = (Br- • 2C2H6OS)
Quantity | Value | Units | Method | Reference | Comment |
---|---|---|---|---|---|
ΔrH° | 60.7 | kJ/mol | PHPMS | Magnera, Caldwell, et al., 1984 | gas phase; M |
Quantity | Value | Units | Method | Reference | Comment |
ΔrS° | 93.7 | J/mol*K | PHPMS | Magnera, Caldwell, et al., 1984 | gas phase; M |
By formula: (Br- • 2C2H6OS) + C2H6OS = (Br- • 3C2H6OS)
Quantity | Value | Units | Method | Reference | Comment |
---|---|---|---|---|---|
ΔrH° | 56.9 | kJ/mol | PHPMS | Magnera, Caldwell, et al., 1984 | gas phase; M |
Quantity | Value | Units | Method | Reference | Comment |
ΔrS° | 115. | J/mol*K | PHPMS | Magnera, Caldwell, et al., 1984 | gas phase; M |
By formula: C2H7OS+ + C2H6OS = (C2H7OS+ • C2H6OS)
Quantity | Value | Units | Method | Reference | Comment |
---|---|---|---|---|---|
ΔrH° | 129. | kJ/mol | PHPMS | Lau, Saluja, et al., 1980 | gas phase; switching reaction((CH3)2SOH+)(CH3)2CO; M |
Quantity | Value | Units | Method | Reference | Comment |
ΔrS° | 95.8 | J/mol*K | PHPMS | Lau, Saluja, et al., 1980 | gas phase; switching reaction((CH3)2SOH+)(CH3)2CO; M |
(C2H7OS+ • ) +
= (C2H7OS+ • 2
)
By formula: (C2H7OS+ • C2H6OS) + C2H6OS = (C2H7OS+ • 2C2H6OS)
Quantity | Value | Units | Method | Reference | Comment |
---|---|---|---|---|---|
ΔrH° | 89.1 | kJ/mol | PHPMS | Lau, Saluja, et al., 1980 | gas phase; Entropy change is questionable; M |
Quantity | Value | Units | Method | Reference | Comment |
ΔrS° | 45.6 | J/mol*K | PHPMS | Lau, Saluja, et al., 1980 | gas phase; Entropy change is questionable; M |
By formula: C4H2O3- + C2H6OS = (C4H2O3- • C2H6OS)
Quantity | Value | Units | Method | Reference | Comment |
---|---|---|---|---|---|
ΔrG° | 28. ± 6.7 | kJ/mol | IMRE | Chowdhury, Grimsrud, et al., 1987 | gas phase; Free energy affinity at 70°C.; B |
Free energy of reaction
ΔrG° (kJ/mol) | T (K) | Method | Reference | Comment |
---|---|---|---|---|
28. | 343. | PHPMS | Chowdhury, 1987 | gas phase; M |
By formula: C6F4O2- + C2H6OS = (C6F4O2- • C2H6OS)
Quantity | Value | Units | Method | Reference | Comment |
---|---|---|---|---|---|
ΔrG° | 19. ± 6.7 | kJ/mol | IMRE | Chowdhury, Grimsrud, et al., 1987 | gas phase; Free energy affinity at 70°C.; B |
Free energy of reaction
ΔrG° (kJ/mol) | T (K) | Method | Reference | Comment |
---|---|---|---|---|
19. | 343. | PHPMS | Chowdhury, 1987 | gas phase; M |
C6H4ClNO2- + = (C6H4ClNO2- •
)
By formula: C6H4ClNO2- + C2H6OS = (C6H4ClNO2- • C2H6OS)
Quantity | Value | Units | Method | Reference | Comment |
---|---|---|---|---|---|
ΔrG° | 31. ± 6.7 | kJ/mol | IMRE | Chowdhury, Grimsrud, et al., 1987 | gas phase; Free energy affinity at 70°C.; B |
Free energy of reaction
ΔrG° (kJ/mol) | T (K) | Method | Reference | Comment |
---|---|---|---|---|
31. | 343. | PHPMS | Chowdhury, 1987 | gas phase; M |
C6H4ClNO2- + = (C6H4ClNO2- •
)
By formula: C6H4ClNO2- + C2H6OS = (C6H4ClNO2- • C2H6OS)
Quantity | Value | Units | Method | Reference | Comment |
---|---|---|---|---|---|
ΔrG° | 33. ± 6.7 | kJ/mol | IMRE | Chowdhury, Grimsrud, et al., 1987 | gas phase; Free energy affinity at 70°C.; B |
Free energy of reaction
ΔrG° (kJ/mol) | T (K) | Method | Reference | Comment |
---|---|---|---|---|
33. | 343. | PHPMS | Chowdhury, 1987 | gas phase; M |
C6H4ClNO2- + = (C6H4ClNO2- •
)
By formula: C6H4ClNO2- + C2H6OS = (C6H4ClNO2- • C2H6OS)
Quantity | Value | Units | Method | Reference | Comment |
---|---|---|---|---|---|
ΔrG° | 32. ± 6.7 | kJ/mol | IMRE | Chowdhury, Grimsrud, et al., 1987 | gas phase; Free energy affinity at 70°C.; B |
Free energy of reaction
ΔrG° (kJ/mol) | T (K) | Method | Reference | Comment |
---|---|---|---|---|
32. | 343. | PHPMS | Chowdhury, 1987 | gas phase; M |
By formula: C6H4FNO2- + C2H6OS = (C6H4FNO2- • C2H6OS)
Quantity | Value | Units | Method | Reference | Comment |
---|---|---|---|---|---|
ΔrG° | 33. ± 6.7 | kJ/mol | IMRE | Chowdhury, Grimsrud, et al., 1987 | gas phase; Free energy affinity at 70°C.; B |
Free energy of reaction
ΔrG° (kJ/mol) | T (K) | Method | Reference | Comment |
---|---|---|---|---|
33. | 343. | PHPMS | Chowdhury, 1987 | gas phase; M |
By formula: C6H4FNO2- + C2H6OS = (C6H4FNO2- • C2H6OS)
Quantity | Value | Units | Method | Reference | Comment |
---|---|---|---|---|---|
ΔrG° | 34. ± 6.7 | kJ/mol | IMRE | Chowdhury, Grimsrud, et al., 1987 | gas phase; Free energy affinity at 70°C.; B |
Free energy of reaction
ΔrG° (kJ/mol) | T (K) | Method | Reference | Comment |
---|---|---|---|---|
34. | 343. | PHPMS | Chowdhury, 1987 | gas phase; M |
By formula: C6H4FNO2- + C2H6OS = (C6H4FNO2- • C2H6OS)
Quantity | Value | Units | Method | Reference | Comment |
---|---|---|---|---|---|
ΔrG° | 33. ± 6.7 | kJ/mol | IMRE | Chowdhury, Grimsrud, et al., 1987 | gas phase; Free energy affinity at 70°C.; B |
Free energy of reaction
ΔrG° (kJ/mol) | T (K) | Method | Reference | Comment |
---|---|---|---|---|
33. | 343. | PHPMS | Chowdhury, 1987 | gas phase; M |
By formula: C6H4NO3- + C2H6OS = (C6H4NO3- • C2H6OS)
Quantity | Value | Units | Method | Reference | Comment |
---|---|---|---|---|---|
ΔrG° | 25. ± 6.7 | kJ/mol | IMRE | Chowdhury, Grimsrud, et al., 1987 | gas phase; Free energy affinity at 70°C.; B |
By formula: C6H4NO3- + C2H6OS = (C6H4NO3- • C2H6OS)
Quantity | Value | Units | Method | Reference | Comment |
---|---|---|---|---|---|
ΔrG° | 31. ± 6.7 | kJ/mol | IMRE | Chowdhury, Grimsrud, et al., 1987 | gas phase; Free energy affinity at 70°C.; B |
By formula: C6H4N2O4- + C2H6OS = (C6H4N2O4- • C2H6OS)
Quantity | Value | Units | Method | Reference | Comment |
---|---|---|---|---|---|
ΔrG° | 18. ± 6.7 | kJ/mol | IMRE | Chowdhury, Grimsrud, et al., 1987 | gas phase; Free energy affinity at 70°C.; B |
Free energy of reaction
ΔrG° (kJ/mol) | T (K) | Method | Reference | Comment |
---|---|---|---|---|
18. | 343. | PHPMS | Chowdhury, 1987 | gas phase; M |
By formula: C6H4N2O4- + C2H6OS = (C6H4N2O4- • C2H6OS)
Quantity | Value | Units | Method | Reference | Comment |
---|---|---|---|---|---|
ΔrG° | 26. ± 6.7 | kJ/mol | IMRE | Chowdhury, Grimsrud, et al., 1987 | gas phase; Free energy affinity at 70°C.; B |
Free energy of reaction
ΔrG° (kJ/mol) | T (K) | Method | Reference | Comment |
---|---|---|---|---|
26. | 343. | PHPMS | Chowdhury, 1987 | gas phase; M |
By formula: C6H4N2O4- + C2H6OS = (C6H4N2O4- • C2H6OS)
Quantity | Value | Units | Method | Reference | Comment |
---|---|---|---|---|---|
ΔrG° | 25. ± 6.7 | kJ/mol | IMRE | Chowdhury, Grimsrud, et al., 1987 | gas phase; Free energy affinity at 70°C.; B |
Free energy of reaction
ΔrG° (kJ/mol) | T (K) | Method | Reference | Comment |
---|---|---|---|---|
25. | 343. | PHPMS | Chowdhury, 1987 | gas phase; M |
By formula: C6H4O2- + C2H6OS = (C6H4O2- • C2H6OS)
Quantity | Value | Units | Method | Reference | Comment |
---|---|---|---|---|---|
ΔrG° | 26. ± 6.7 | kJ/mol | IMRE | Chowdhury, Grimsrud, et al., 1987 | gas phase; Free energy affinity at 70°C.; B |
Free energy of reaction
ΔrG° (kJ/mol) | T (K) | Method | Reference | Comment |
---|---|---|---|---|
26. | 343. | PHPMS | Chowdhury, 1987 | gas phase; M |
By formula: C6H5NO2- + C2H6OS = (C6H5NO2- • C2H6OS)
Quantity | Value | Units | Method | Reference | Comment |
---|---|---|---|---|---|
ΔrH° | 70.29 ± 0.42 | kJ/mol | TDAs | Sieck, 1985 | gas phase; B,M |
Quantity | Value | Units | Method | Reference | Comment |
ΔrS° | 103. | J/mol*K | PHPMS | Sieck, 1985 | gas phase; M |
Quantity | Value | Units | Method | Reference | Comment |
ΔrG° | 39.7 ± 0.84 | kJ/mol | TDAs | Sieck, 1985 | gas phase; B |
ΔrG° | 36. ± 6.7 | kJ/mol | IMRE | Chowdhury, Grimsrud, et al., 1987 | gas phase; Free energy affinity at 70°C.; B |
By formula: C7F14- + C2H6OS = (C7F14- • C2H6OS)
Free energy of reaction
ΔrG° (kJ/mol) | T (K) | Method | Reference | Comment |
---|---|---|---|---|
32. | 308. | PHPMS | Knighton, Zook, et al., 1990 | gas phase; M |
C7H4F3NO2- + = (C7H4F3NO2- •
)
By formula: C7H4F3NO2- + C2H6OS = (C7H4F3NO2- • C2H6OS)
Quantity | Value | Units | Method | Reference | Comment |
---|---|---|---|---|---|
ΔrH° | 61.1 ± 8.4 | kJ/mol | N/A | Chowdhury, Grimsrud, et al., 1987 | gas phase; Free energy affinity at 70°C.; B,M |
Quantity | Value | Units | Method | Reference | Comment |
ΔrS° | 93.3 | J/mol*K | PHPMS | Chowdhury, 1987 | gas phase; M |
Quantity | Value | Units | Method | Reference | Comment |
ΔrG° | 30. ± 8.4 | kJ/mol | TDAs | Chowdhury, Grimsrud, et al., 1987 | gas phase; Free energy affinity at 70°C.; B |
By formula: C7H4N2O2- + C2H6OS = (C7H4N2O2- • C2H6OS)
Quantity | Value | Units | Method | Reference | Comment |
---|---|---|---|---|---|
ΔrG° | 28. ± 6.7 | kJ/mol | IMRE | Chowdhury, Grimsrud, et al., 1987 | gas phase; Free energy affinity at 70°C.; B |
Free energy of reaction
ΔrG° (kJ/mol) | T (K) | Method | Reference | Comment |
---|---|---|---|---|
28. | 343. | PHPMS | Chowdhury, 1987 | gas phase; M |
By formula: C7H4N2O2- + C2H6OS = (C7H4N2O2- • C2H6OS)
Quantity | Value | Units | Method | Reference | Comment |
---|---|---|---|---|---|
ΔrG° | 28. ± 6.7 | kJ/mol | IMRE | Chowdhury, Grimsrud, et al., 1987 | gas phase; Free energy affinity at 70°C.; B |
Free energy of reaction
ΔrG° (kJ/mol) | T (K) | Method | Reference | Comment |
---|---|---|---|---|
28. | 343. | PHPMS | Chowdhury, 1987 | gas phase; M |
By formula: C7H4N2O2- + C2H6OS = (C7H4N2O2- • C2H6OS)
Quantity | Value | Units | Method | Reference | Comment |
---|---|---|---|---|---|
ΔrH° | 66.9 | kJ/mol | PHPMS | Chowdhury, 1987 | gas phase; M |
Quantity | Value | Units | Method | Reference | Comment |
ΔrS° | 141. | J/mol*K | PHPMS | Chowdhury, 1987 | gas phase; M |
By formula: C7H7NO2- + C2H6OS = (C7H7NO2- • C2H6OS)
Quantity | Value | Units | Method | Reference | Comment |
---|---|---|---|---|---|
ΔrG° | 36. ± 6.7 | kJ/mol | IMRE | Chowdhury, Grimsrud, et al., 1987 | gas phase; Free energy affinity at 70°C.; B |
Free energy of reaction
ΔrG° (kJ/mol) | T (K) | Method | Reference | Comment |
---|---|---|---|---|
36. | 343. | PHPMS | Chowdhury, 1987 | gas phase; M |
By formula: C7H7NO3- + C2H6OS = (C7H7NO3- • C2H6OS)
Quantity | Value | Units | Method | Reference | Comment |
---|---|---|---|---|---|
ΔrH° | 68.2 ± 8.4 | kJ/mol | N/A | Chowdhury, Grimsrud, et al., 1987 | gas phase; Free energy affinity at 70°C.; B,M |
Quantity | Value | Units | Method | Reference | Comment |
ΔrS° | 94.1 | J/mol*K | PHPMS | Chowdhury, 1987 | gas phase; M |
Quantity | Value | Units | Method | Reference | Comment |
ΔrG° | 35. ± 8.4 | kJ/mol | TDAs | Chowdhury, Grimsrud, et al., 1987 | gas phase; Free energy affinity at 70°C.; B |
By formula: C10H6O2- + C2H6OS = (C10H6O2- • C2H6OS)
Free energy of reaction
ΔrG° (kJ/mol) | T (K) | Method | Reference | Comment |
---|---|---|---|---|
24. | 343. | PHPMS | Chowdhury, 1987 | gas phase; M |
+
= C12H12O3S-
By formula: C10H6O2- + C2H6OS = C12H12O3S-
Quantity | Value | Units | Method | Reference | Comment |
---|---|---|---|---|---|
ΔrG° | 24. ± 6.7 | kJ/mol | IMRE | Chowdhury, Grimsrud, et al., 1987 | gas phase; Free energy affinity at 70°C.; B |
By formula: Cl- + C2H6OS = (Cl- • C2H6OS)
Quantity | Value | Units | Method | Reference | Comment |
---|---|---|---|---|---|
ΔrH° | 77.82 | kJ/mol | TDAs | Magnera, Caldwell, et al., 1984 | gas phase; B,M |
Quantity | Value | Units | Method | Reference | Comment |
ΔrS° | 85.4 | J/mol*K | PHPMS | Magnera, Caldwell, et al., 1984 | gas phase; M |
Quantity | Value | Units | Method | Reference | Comment |
ΔrG° | 52.30 | kJ/mol | TDAs | Magnera, Caldwell, et al., 1984 | gas phase; B |
By formula: (Cl- • C2H6OS) + C2H6OS = (Cl- • 2C2H6OS)
Quantity | Value | Units | Method | Reference | Comment |
---|---|---|---|---|---|
ΔrH° | 66.9 | kJ/mol | PHPMS | Magnera, Caldwell, et al., 1984 | gas phase; M |
Quantity | Value | Units | Method | Reference | Comment |
ΔrS° | 99.6 | J/mol*K | PHPMS | Magnera, Caldwell, et al., 1984 | gas phase; M |
By formula: (Cl- • 2C2H6OS) + C2H6OS = (Cl- • 3C2H6OS)
Quantity | Value | Units | Method | Reference | Comment |
---|---|---|---|---|---|
ΔrH° | 62.3 | kJ/mol | PHPMS | Magnera, Caldwell, et al., 1984 | gas phase; M |
Quantity | Value | Units | Method | Reference | Comment |
ΔrS° | 125. | J/mol*K | PHPMS | Magnera, Caldwell, et al., 1984 | gas phase; M |
By formula: (Cl- • 3C2H6OS) + C2H6OS = (Cl- • 4C2H6OS)
Quantity | Value | Units | Method | Reference | Comment |
---|---|---|---|---|---|
ΔrH° | 61.1 | kJ/mol | PHPMS | Magnera, Caldwell, et al., 1984 | gas phase; M |
Quantity | Value | Units | Method | Reference | Comment |
ΔrS° | 156. | J/mol*K | PHPMS | Magnera, Caldwell, et al., 1984 | gas phase; M |
By formula: (Cl- • 4C2H6OS) + C2H6OS = (Cl- • 5C2H6OS)
Quantity | Value | Units | Method | Reference | Comment |
---|---|---|---|---|---|
ΔrH° | 57.7 | kJ/mol | PHPMS | Magnera, Caldwell, et al., 1984 | gas phase; M |
Quantity | Value | Units | Method | Reference | Comment |
ΔrS° | 168. | J/mol*K | PHPMS | Magnera, Caldwell, et al., 1984 | gas phase; M |
By formula: F6S- + C2H6OS = (F6S- • C2H6OS)
Free energy of reaction
ΔrG° (kJ/mol) | T (K) | Method | Reference | Comment |
---|---|---|---|---|
30. | 308. | PHPMS | Knighton, Zook, et al., 1990 | gas phase; M |
By formula: I- + C2H6OS = (I- • C2H6OS)
Quantity | Value | Units | Method | Reference | Comment |
---|---|---|---|---|---|
ΔrH° | 65.69 | kJ/mol | TDAs | Magnera, Caldwell, et al., 1984 | gas phase; B,M |
ΔrH° | 67. | kJ/mol | PHPMS | Caldwell, Masucci, et al., 1989 | gas phase; M |
Quantity | Value | Units | Method | Reference | Comment |
ΔrS° | 90.8 | J/mol*K | PHPMS | Magnera, Caldwell, et al., 1984 | gas phase; M |
Quantity | Value | Units | Method | Reference | Comment |
ΔrG° | 38.5 | kJ/mol | TDAs | Magnera, Caldwell, et al., 1984 | gas phase; B |
By formula: (I- • C2H6OS) + C2H6OS = (I- • 2C2H6OS)
Quantity | Value | Units | Method | Reference | Comment |
---|---|---|---|---|---|
ΔrH° | 53.6 | kJ/mol | PHPMS | Magnera, Caldwell, et al., 1984 | gas phase; M |
Quantity | Value | Units | Method | Reference | Comment |
ΔrS° | 92.0 | J/mol*K | PHPMS | Magnera, Caldwell, et al., 1984 | gas phase; M |
By formula: (I- • 2C2H6OS) + C2H6OS = (I- • 3C2H6OS)
Quantity | Value | Units | Method | Reference | Comment |
---|---|---|---|---|---|
ΔrH° | 48.5 | kJ/mol | PHPMS | Magnera, Caldwell, et al., 1984 | gas phase; M |
Quantity | Value | Units | Method | Reference | Comment |
ΔrS° | 105. | J/mol*K | PHPMS | Magnera, Caldwell, et al., 1984 | gas phase; M |
By formula: K+ + C2H6OS = (K+ • C2H6OS)
Quantity | Value | Units | Method | Reference | Comment |
---|---|---|---|---|---|
ΔrH° | 130. | kJ/mol | CIDT | Klassen, Anderson, et al., 1996 | RCD |
ΔrH° | 150. | kJ/mol | HPMS | Sunner, 1984 | gas phase; M |
Quantity | Value | Units | Method | Reference | Comment |
ΔrS° | 130. | J/mol*K | HPMS | Sunner, 1984 | gas phase; M |
By formula: (K+ • C2H6OS) + C2H6OS = (K+ • 2C2H6OS)
Quantity | Value | Units | Method | Reference | Comment |
---|---|---|---|---|---|
ΔrH° | 120. | kJ/mol | HPMS | Sunner, 1984 | gas phase; M |
Quantity | Value | Units | Method | Reference | Comment |
ΔrS° | 140. | J/mol*K | HPMS | Sunner, 1984 | gas phase; M |
By formula: (K+ • 2C2H6OS) + C2H6OS = (K+ • 3C2H6OS)
Quantity | Value | Units | Method | Reference | Comment |
---|---|---|---|---|---|
ΔrH° | 84. | kJ/mol | HPMS | Sunner, 1984 | gas phase; M |
Quantity | Value | Units | Method | Reference | Comment |
ΔrS° | 120. | J/mol*K | HPMS | Sunner, 1984 | gas phase; M |
By formula: (K+ • 3C2H6OS) + C2H6OS = (K+ • 4C2H6OS)
Quantity | Value | Units | Method | Reference | Comment |
---|---|---|---|---|---|
ΔrH° | 67. | kJ/mol | HPMS | Sunner, 1984 | gas phase; M |
Quantity | Value | Units | Method | Reference | Comment |
ΔrS° | 130. | J/mol*K | HPMS | Sunner, 1984 | gas phase; M |
By formula: (K+ • 4C2H6OS) + C2H6OS = (K+ • 5C2H6OS)
Quantity | Value | Units | Method | Reference | Comment |
---|---|---|---|---|---|
ΔrH° | 66.1 | kJ/mol | HPMS | Sunner, 1984 | gas phase; Entropy change is questionable; M |
Quantity | Value | Units | Method | Reference | Comment |
ΔrS° | 150. | J/mol*K | HPMS | Sunner, 1984 | gas phase; Entropy change is questionable; M |
By formula: (K+ • 5C2H6OS) + C2H6OS = (K+ • 6C2H6OS)
Quantity | Value | Units | Method | Reference | Comment |
---|---|---|---|---|---|
ΔrH° | 64.9 | kJ/mol | HPMS | Sunner, 1984 | gas phase; Entropy change is questionable; M |
Quantity | Value | Units | Method | Reference | Comment |
ΔrS° | 170. | J/mol*K | HPMS | Sunner, 1984 | gas phase; Entropy change is questionable; M |
By formula: NO2- + C2H6OS = (NO2- • C2H6OS)
Quantity | Value | Units | Method | Reference | Comment |
---|---|---|---|---|---|
ΔrH° | 80.3 ± 4.2 | kJ/mol | TDAs | Sieck, 1985 | gas phase; B,M |
Quantity | Value | Units | Method | Reference | Comment |
ΔrS° | 100. | J/mol*K | N/A | Sieck, 1985 | gas phase; Entropy change calculated or estimated; M |
Quantity | Value | Units | Method | Reference | Comment |
ΔrG° | 36. ± 4.2 | kJ/mol | TDAs | Sieck, 1985 | gas phase; B |
Free energy of reaction
ΔrG° (kJ/mol) | T (K) | Method | Reference | Comment |
---|---|---|---|---|
36. | 420. | PHPMS | Sieck, 1985 | gas phase; Entropy change calculated or estimated; M |
By formula: Na+ + C2H6OS = (Na+ • C2H6OS)
Quantity | Value | Units | Method | Reference | Comment |
---|---|---|---|---|---|
ΔrH° | 130. | kJ/mol | CID | Klassen, Anderson, et al., 1996 | RCD |
Free energy of reaction
ΔrG° (kJ/mol) | T (K) | Method | Reference | Comment |
---|---|---|---|---|
130. | 298. | IMRE | McMahon and Ohanessian, 2000 | Anchor alanine=39.89; RCD |

Kovats' RI, non-polar column, isothermal

Column type | Active phase | Temperature (C) | I | Reference | Comment |
---|---|---|---|---|---|
Capillary | Methyl Silicone | 100. | 780. | Huber, Kenndler, et al., 1993 | H2; Column length: 5. m; Phase thickness: 2.65 μm |
Capillary | Methyl Silicone | 120. | 784. | Huber, Kenndler, et al., 1993 | H2; Column length: 5. m; Phase thickness: 2.65 μm |
Capillary | Methyl Silicone | 80. | 777. | Huber, Kenndler, et al., 1993 | H2; Column length: 5. m; Phase thickness: 2.65 μm |

Kovats' RI, polar column, isothermal

Column type | Active phase | Temperature (C) | I | Reference | Comment |
---|---|---|---|---|---|
Capillary | PEG-20M | 130. | 1569. | Huber, Kenndler, et al., 1993 | Column length: 10. m; Phase thickness: 1.33 μm |
Capillary | PEG-20M | 150. | 1584. | Huber, Kenndler, et al., 1993 | Column length: 10. m; Phase thickness: 1.33 μm |
Capillary | PEG-20M | 130. | 1569.1 | Huber, Kenndler, et al., 1993 | Column length: 10. m; Phase thickness: 1.33 μm |

Van Den Dool and Kratz RI, non-polar column, temperature ramp

Column type | Active phase | I | Reference | Comment |
---|---|---|---|---|
Capillary | DB-1 | 782. | Hancock and Peters, 1991 | He, 50. C @ 2. min, 10. K/min; Column length: 15. m; Column diameter: 0.53 mm |
Capillary | DB-5 | 820.1 | Hancock and Peters, 1991 | He, 50. C @ 2. min, 10. K/min; Column length: 15. m; Column diameter: 0.53 mm |
Capillary | DB-5 | 820.5 | Hancock and Peters, 1991 | He, 50. C @ 2. min, 10. K/min; Column length: 15. m; Column diameter: 0.53 mm |
Capillary | DB-5 | 829.2 | Hancock and Peters, 1991 | He, 50. C @ 2. min, 10. K/min; Column length: 15. m; Column diameter: 0.53 mm |
Capillary | DB-1 | 786.6 | D'Agostino and Provost, 1985 | 15. m/0.32 mm/0.25 μm, He, 50. C @ 2. min, 10. K/min, 300. C @ 5. min |

Van Den Dool and Kratz RI, polar column, temperature ramp

Column type | Active phase | I | Reference | Comment |
---|---|---|---|---|
Capillary | Stabilwax | 1560. | Cros, Lignot, et al., 2005 | 60. m/0.25 mm/0.25 μm, He, 40. C @ 5. min, 3. K/min, 240. C @ 10. min |
Capillary | Stabilwax | 1560. | Cros, Vandanjon, et al., 2003 | 60. m/0.25 mm/0.25 μm, He, 40. C @ 5. min, 3. K/min, 240. C @ 10. min |
Capillary | Supelcowax-10 | 1563. | Chung, 1999 | 60. m/0.25 mm/0.25 μm, He, 35. C @ 5. min, 2. K/min, 195. C @ 90. min |
Capillary | DB-Wax | 1582.3 | D'Agostino and Provost, 1985 | 15. m/0.32 mm/0.25 μm, He, 50. C @ 2. min, 10. K/min, 250. C @ 5. min |

Normal alkane RI, non-polar column, temperature ramp

Column type | Active phase | I | Reference | Comment |
---|---|---|---|---|
Capillary | OV-101 | 790. | Zenkevich, 2005 | 25. m/0.20 mm/0.10 μm, N2/He, 6. K/min; Tstart: 50. C; Tend: 250. C |
Capillary | HP-1 | 772. | Valette, Fernandez, et al., 2003 | 50. m/0.2 mm/0.5 μm, He, 2. K/min, 220. C @ 40. min; Tstart: 60. C |

Normal alkane RI, non-polar column, custom temperature program

Column type | Active phase | I | Reference | Comment |
---|---|---|---|---|
Capillary | CP-Sil5 CB MS | 780. | Iraqi, Vermeulen, et al., 2005 | 50. m/0.32 mm/1.2 μm; Program: 36C(2min) => 20C/min => 85C => 1C/min => 145C => 3C/min => 250C(30min) |
Capillary | SPB-5 | 827. | Begnaud, Pérès, et al., 2003 | 60. m/0.32 mm/1. μm; Program: not specified |
Capillary | SPB-1 | 784. | Flanagan, Streete, et al., 1997 | 60. m/0.53 mm/5. μm, He; Program: 40C(6min) => 5C/min => 80C => 10C/min => 200C |
Capillary | SPB-1 | 784. | Strete, Ruprah, et al., 1992 | 60. m/0.53 mm/5.0 μm, Helium; Program: 40 0C (6 min) 5 0C/min -> 80 0C 10 0C/min -> 200 0C |
Capillary | OV-1, SE-30, Methyl silicone, SP-2100, OV-101, DB-1, etc. | 787. | Waggott and Davies, 1984 | Hydrogen; Column length: 50. m; Column diameter: 0.32 mm; Program: not specified |

Normal alkane RI, polar column, temperature ramp

Column type | Active phase | I | Reference | Comment |
---|---|---|---|---|
Capillary | HP-Innowax | 1603. | Puvipirom and Chaisei, 2012 | 15. m/0.32 mm/0.50 μm, Helium, 3. K/min; Tstart: 40. C; Tend: 250. C |
Capillary | HP-Innowax | 1582. | Soria, Sanz, et al., 2008 | 50. m/0.20 mm/0.20 μm, Helium, 45. C @ 2. min, 4. K/min, 190. C @ 50. min |
Capillary | Stabilwax | 1560. | Cros, Vandanjon, et al., 2007 | 60. m/0.25 mm/0.25 μm, Helium, 40. C @ 5. min, 3. K/min, 240. C @ 10. min |
Capillary | RTX-Wax | 1569. | Prososki, Etzel, et al., 2007 | 30. m/0.25 mm/0.5 μm, He, 40. C @ 5. min, 10. K/min, 220. C @ 10. min |
Capillary | HP-Innowax | 1596. | Soria, Gonzalez, et al., 2004 | 50. m/0.2 mm/0.2 μm, He, 45. C @ 2. min, 4. K/min, 190. C @ 50. min |
Capillary | Stabilwax | 1560. | Cros, Vandanjon, et al., 2003, 2 | 60. m/0.25 mm/0.25 μm, Helium, 40. C @ 5. min, 3. K/min, 240. C @ 10. min |
Capillary | DB-Wax | 1553. | Wei, Mura, et al., 2001 | 60. m/0.25 mm/0.25 μm, He, 2. K/min; Tstart: 40. C; Tend: 200. C |
Capillary | DB-Wax | 1595. | Iwatsuki, Mizota, et al., 1999 | 4. K/min; Column length: 30. m; Column diameter: 0.53 mm; Tstart: 60. C; Tend: 210. C |

Normal alkane RI, polar column, custom temperature program

Column type | Active phase | I | Reference | Comment |
---|---|---|---|---|
Capillary | SOLGel-Wax | 1576. | Johanningsmeier and McFeeters, 2011 | 30. m/0.25 mm/0.25 μm, Helium; Program: 40 0C (2 min) 5 0C/min -> 140 0C 10 0C/min -> 250 0C (3 min) |
Capillary | SOLGel-Wax | 1582. | Johanningsmeier and McFeeters, 2011 | 30. m/0.25 mm/0.25 μm, Helium; Program: not specified |
Capillary | DB-FFAP | 1553. | Mebazaa, Mahmoudi, et al., 2009 | 30. m/0.25 mm/0.25 μm, Helium; Program: 50 0C 2 0C/min -> 100 0C (5 min) 5 0C/min -> 250 0C |
Capillary | DB-FFAP | 1549. | Mebazaa, Mahmoudi, et al., 2009 | 30. m/0.25 mm/0.25 μm, Helium; Program: not specified |
Capillary | CP-Wax 52 CB | 1550. | Kaack and Christensen, 2008 | 50. m/0.25 mm/0.29 μm, Helium; Program: 33 0C (1 min) 2 0C/min -> 130 0C 10 0C/min -> 220 0C |
Capillary | DB-Wax | 1579. | Kim. J.H., Ahn, et al., 2004 | 60. m/0.25 mm/0.25 μm, Helium; Program: 60 0C (3 min) 2 0C/min -> 150 0C 4 0C/min -> 200 0C |
Capillary | Carbowax 20M | 1554. | Vinogradov, 2004 | Program: not specified |

References

Masuda, Nagano, et al., 1994
Masuda, N.; Nagano, Y.; Sakiyama, M.,
Standard molar enthalpy of formation of (CH3)2SO, dimethylsulfoxide, by combustion calorimetry,
J. Chem. Thermodyn., 1994, 26, 971-975. [all data]
Clever and Westrum, 1970
Clever, H.L.; Westrum, E.F., Jr.,
Dimethylsulfoxide and dimethylsulfone. Heat capacities, enthalpies of fusion, and thermodynamic properties,
J. Phys. Chem., 1970, 74, 1309-1317. [all data]
Grolier, Roux-Desgranges, et al., 1993
Grolier, J.-P.E.; Roux-Desgranges, G.; Berkane, M.; Jimenez, E.; Wilhelm, E.,
Heat capacities and densities of mixtures of very polar substances 2. Mixtures containing N,N-dimethylformamide,
J. Chem. Thermodynam., 1993, 25(1), 41-50. [all data]
Barta, Kooner, et al., 1989
Barta, L.; Kooner, Z.S.; Hepler, L.G.; Roux-Desgranges, G.; Grolier, J.-P.E.,
Thermal and volumetric properties of chloroform dimethylsulfoxide: Thermodynamic analysis using the ideal associated solution model,
J. Solution Chem., 1989, 18(7), 663-673. [all data]
Rodante and Marrosu, 1988
Rodante, F.; Marrosu, G.,
Excess molar isobaric heat capacities and excess molar enthalpies for water-dimethylsulfoxide mixtures at 25°C,
Thermochim. Acta, 1988, 136, 209-218. [all data]
Lankford and Criss, 1987
Lankford, J.I.; Criss, C.M.,
Partial molar heat caqpacities of selected electrolytes and benzene in methanol and dimethyldulfoxide at 25, 40 and 80°C,
J. Solution Chem., 1987, 16(11), 885-906. [all data]
de Visser and Somsen, 1979
de Visser, C.; Somsen, G.,
Thermochemical behavior of mixtures of N,N-dimethylformamide with dimethylsulfoxide, acetonitrile, and N-methylformamide: volumes and heat capacities,
J. Solution Chem., 1979, 8, 593-600. [all data]
De Visser, Heuvelsland, et al., 1978
De Visser, C.; Heuvelsland, W.J.M.; Dunn, L.A.; Somsen, G.,
Some properties of binary aqueous liquid mixtures, J. Chem. Soc.,
Faraday Trans.1, 1978, 74, 1159-1169. [all data]
Kenttmaa and Lindberg, 1960
Kenttmaa, J.; Lindberg, J.J.,
Volumes and heats of mixing of dimethyl sulfoxide-water solutions,
Suom. Kemistilehti, 1960, B33, 32-35. [all data]
Lindberg and Stenholm, 1966
Lindberg, J.J.; Stenholm, V.,
Viscosities, Densities, and Related Properties of Binary Mixtures Containing Dimethyl Sulphoxide and Mono-Subst. Benzenes or Guaiacol,
Suom. Kemistiseuran Tied., 1966, 75, 22. [all data]
Douglas, 1948
Douglas, T.B.,
Vapor Pressure of Methyl Sulfoxide from 20 to 50 deg. Calculation of the Heat of Vaporization,
J. Am. Chem. Soc., 1948, 70, 2001. [all data]
Douglas, 1946
Douglas, T.B.,
Heats of Formation of Liquid Methyl Sulfoxide and Crystalline Methyl Sulfone at 18 deg.,
J. Am. Chem. Soc., 1946, 68, 1072. [all data]
Clever and Westrum, 1970, 2
Clever, H.L.; Westrum, E.F.,
Dimethyl sulfoxide and dimethyl sulfone. Heat capacities, enthalpies of fusion, and thermodynamic properties.,
J. Phys. Chem., 1970, 74, 1309. [all data]
Douglas, 1948, 2
Douglas, T.B.,
Vapor pressure of methyl sulfoxide from 20 to 50°. Calculation of the heat of vaporization,
J. Am. Chem. Soc., 1948, 70, 2001-20. [all data]
Douglas, 1948, 3
Douglas, Thomas B.,
Vapor Pressure of Methyl Sulfoxide from 20 to 50°. Calculation of the Heat of Vaporization,
J. Am. Chem. Soc., 1948, 70, 6, 2001-2002, https://doi.org/10.1021/ja01186a005
. [all data]
Al-Najjar and Al-Sammerrai, 2007
Al-Najjar, Hazim; Al-Sammerrai, Dhoaib,
Thermogravimetric determination of the heat of vaporization of some highly polar solvents,
J. Chem. Technol. Biotechnol., 2007, 37, 3, 145-152, https://doi.org/10.1002/jctb.280370302
. [all data]
Dykyj, Svoboda, et al., 1999
Dykyj, J.; Svoboda, J.; Wilhoit, R.C.; Frenkel, M.L.; Hall, K.R.,
Vapor Pressure of Chemicals: Part A. Vapor Pressure and Antoine Constants for Hydrocarbons and Sulfur, Selenium, Tellurium and Hydrogen Containing Organic Compounds, Springer, Berlin, 1999, 373. [all data]
Stephenson and Malanowski, 1987
Stephenson, Richard M.; Malanowski, Stanislaw,
Handbook of the Thermodynamics of Organic Compounds, 1987, https://doi.org/10.1007/978-94-009-3173-2
. [all data]
Sassa, Konishi, et al., 1974
Sassa, Yoshimasa; Konishi, Ryoichi; Katayama, Takashi,
Isothermal vapor-liquid equilibrium data of DMSO [dimethyl sulfoxide] solutions by total pressure method. DMSO-acetone, DMSO-tetrahydrofuran, and DMSO-ethyl acetate systems,
J. Chem. Eng. Data, 1974, 19, 1, 44-48, https://doi.org/10.1021/je60060a004
. [all data]
Jakli and Alexander Van Hook, 1972
Jakli, Gyorgy; Alexander Van Hook, W.,
The vapor pressures of dimethyl sulfoxide and hexadeuterodimethyl sulfoxide from about 313 to 453 K,
The Journal of Chemical Thermodynamics, 1972, 4, 6, 857-864, https://doi.org/10.1016/0021-9614(72)90007-9
. [all data]
Boublik, Fried, et al., 1984
Boublik, T.; Fried, V.; Hala, E.,
The Vapour Pressures of Pure Substances: Selected Values of the Temperature Dependence of the Vapour Pressures of Some Pure Substances in the Normal and Low Pressure Region, 2nd ed., Elsevier, New York, 1984, 972. [all data]
NISHIMURA, NAKAYAMA, et al., 1972
NISHIMURA, MICHIKO; NAKAYAMA, MUTSUO; YANO, TAKEO,
VAPOR PRESSURE OF PURE DMSO AND VAPOR-LIQUID EQUILIBRIA IN DMSO-H2O SYSTEM UNDER ISOBARIC CONDITIONS,
J. Chem. Eng. Japan / JCEJ, 1972, 5, 3, 223-226, https://doi.org/10.1252/jcej.5.223
. [all data]
Meszaros, 1969
Meszaros, S.,
Period. Polytech., Chem. Eng., 1969, 13, 1-2, 79. [all data]
Jakli and van Hook, 1972
Jakli, G.; van Hook, W.A.,
The Vapor Pressures of Dimethyl Sulfoxide and Hexadeuterodimethyl Sulfoxide from about 313 to 453 K,
J. Chem. Thermodyn., 1972, 4, 6, 857-864, https://doi.org/10.1016/0021-9614(72)90007-9
. [all data]
Domalski and Hearing, 1996
Domalski, Eugene S.; Hearing, Elizabeth D.,
Heat Capacities and Entropies of Organic Compounds in the Condensed Phase. Volume III,
J. Phys. Chem. Ref. Data, 1996, 25, 1, 1, https://doi.org/10.1063/1.555985
. [all data]
Bartmess, Scott, et al., 1979
Bartmess, J.E.; Scott, J.A.; McIver, R.T., Jr.,
The gas phase acidity scale from methanol to phenol,
J. Am. Chem. Soc., 1979, 101, 6047. [all data]
Cumming and Kebarle, 1978
Cumming, J.B.; Kebarle, P.,
Summary of gas phase measurements involving acids AH. Entropy changes in proton transfer reactions involving negative ions. Bond dissociation energies D(A-H) and electron affinities EA(A),
Can. J. Chem., 1978, 56, 1. [all data]
Sieck, 1985
Sieck, L.W.,
Thermochemistry of Solvation of NO2- and C6H5NO2- by Polar Molecules in the Vapor Phase. Comparison with Cl- and Variation with Ligand Structure.,
J. Phys. Chem., 1985, 89, 25, 5552, https://doi.org/10.1021/j100271a049
. [all data]
Chowdhury, Grimsrud, et al., 1987
Chowdhury, S.; Grimsrud, E.P.; Kebarle, P.,
Bonding of Charged Delocalized Anions to Protic and Dipolar Aprotic Solvent Molecules,
J. Phys. Chem., 1987, 91, 10, 2551, https://doi.org/10.1021/j100294a021
. [all data]
Chowdhury, 1987
Chowdhury, S. Grimsrud,
Bonding of Charge Delocalized Anions to Protic and Dipolar Aprotic Solvents,
J. Phys. Chem., 1987, 91, 10, 2551, https://doi.org/10.1021/j100294a021
. [all data]
Magnera, Caldwell, et al., 1984
Magnera, T.F.; Caldwell, G.; Sumner, J.; Ikuta, S.; Kebarle, P.,
Solvation of the halide anions in dimethyl sulfoxide. Factors involved in enhanced reactivity of negative ions in dipolar aprotic solvents,
J. Am. Chem. Soc., 1984, 106, 6140. [all data]
Caldwell, Masucci, et al., 1989
Caldwell, G.W.; Masucci, J.A.; Ikonomou, M.G.,
Negative Ion Chemical Ionization Mass Spectrometry - Binding of Molecules to Bromide and Iodide Anions,
Org. Mass Spectrom., 1989, 24, 1, 8, https://doi.org/10.1002/oms.1210240103
. [all data]
Lau, Saluja, et al., 1980
Lau, Y.K.; Saluja, P.P.S.; Kebarle, P.,
The Proton in Dimethyl Sulfoxide and Acetone. Results from Gas - Phase Ion Equilibria Involving (Me2SO)nH+ and (Me2CO)nH+,
J. Am. Chem. Soc., 1980, 102, 25, 7429, https://doi.org/10.1021/ja00545a004
. [all data]
Sunner, 1984
Sunner, J. Kebarle,
Ion - Solvent Molecule Interactions in the Gas Phase. The Potassium Ion and Me2SO, DMA, DMF, and Acetone,
J. Am. Chem. Soc., 1984, 106, 21, 6135, https://doi.org/10.1021/ja00333a002
. [all data]
Klassen, Anderson, et al., 1996
Klassen, J.S.; Anderson, S.G.; Blades, A.T.; Kebarle, P.,
Reaction Enthalpies for M+L = M+ + L, Where M+ = Na+ and K+ and L = Acetamide, N-Methylacetamide, N,N-Dimethylacetamide, Glycine, and Glycylglycine, from Determinations of the Collision-Induced Dissociation Thresholds,
J. Phys. Chem., 1996, 100, 33, 14218, https://doi.org/10.1021/jp9608382
. [all data]
Douglas, 1946, 2
Douglas, T.B.,
Heats of formation of liquid methyl sulfoxide and crystalline methyl sulfone at 18°,
J. Am. Chem. Soc., 1946, 68, 1072-1076. [all data]
Cox and Pilcher, 1970
Cox, J.D.; Pilcher, G.,
Thermochemistry of Organic and Organometallic Compounds, Academic Press, New York, 1970, 1-636. [all data]
McMahon and Ohanessian, 2000
McMahon, T.B.; Ohanessian, G.,
An Experimental and Ab Initio Study of the Nature of the Binding in Gas-Phase Complexes of Sodium Ions,
Chem. Eur. J., 2000, 6, 16, 2931, https://doi.org/10.1002/1521-3765(20000818)6:16<2931::AID-CHEM2931>3.0.CO;2-7
. [all data]
Knighton, Zook, et al., 1990
Knighton, W.B.; Zook, D.R.; Grimsrud, E.P.,
Cluster-Assisted Decomposition Reactions of the Molecular Anions of SF6 and C7F14,
J. Am. Soc. Mass Spectrom., 1990, 1, 5, 372, https://doi.org/10.1016/1044-0305(90)85017-G
. [all data]
Hunter and Lias, 1998
Hunter, E.P.; Lias, S.G.,
Evaluated Gas Phase Basicities and Proton Affinities of Molecules: An Update,
J. Phys. Chem. Ref. Data, 1998, 27, 3, 413-656, https://doi.org/10.1063/1.556018
. [all data]
Hammer, Diri, et al., 2003
Hammer, N.I.; Diri, K.; Jordan, K.D.; Desfrancois, C.; Compton, R.N.,
Dipole-bound anions of carbonyl, nitrile, and sulfoxide containing molecules,
J. Chem. Phys., 2003, 119, 7, 3650-3660, https://doi.org/10.1063/1.1590959
. [all data]
Suess, Liu, et al., 2003
Suess, L.; Liu, Y.; Parthasarathy, R.; Dunning, F.B.,
Dipole-bound negative ions: Collisional destruction and blackbody-radiation-induced photodetachment,
J. Chem. Phys., 2003, 119, 24, 12890-12894, https://doi.org/10.1063/1.1628215
. [all data]
Kimura, Katsumata, et al., 1981
Kimura, K.; Katsumata, S.; Achiba, Y.; Yamazaki, T.; Iwata, S.,
Ionization energies, Ab initio assignments, and valence electronic structure for 200 molecules
in Handbook of HeI Photoelectron Spectra of Fundamental Organic Compounds, Japan Scientific Soc. Press, Tokyo, 1981. [all data]
Potzinger, Stracke, et al., 1975
Potzinger, P.; Stracke, H.-U.; Kupper, W.; Gollnick, K.,
Ionisierungs- und Auftrittspotentialmessungen an Dialkylsulfoxiden,
Z. Naturforsch. A:, 1975, 30, 340. [all data]
Distefano, Foffani, et al., 1971
Distefano, G.; Foffani, A.; Innorta, G.; Pignataro, S.,
Mass spectrometric study of transition metal complexes with ligands having nitrogen or sulphur as donor atom,
Adv. Mass Spectrom., 1971, 5, 696. [all data]
Distefano, Foffani, et al., 1971, 2
Distefano, G.; Foffani, A.; Innorta, G.; Pignataro, S.,
Electron impact ionization potentials of some manganese, chromium and tungsten organometallic derivatives,
Int. J. Mass Spectrom. Ion Phys., 1971, 7, 383. [all data]
Blais, Cottin, et al., 1970
Blais, J.-C.; Cottin, M.; Gitton, B.,
Ionisation positive et negative dans le dimethylsulfoxyde en phase gazeuse,
J. Chim. Phys., 1970, 67, 1475. [all data]
Bock and Solouki, 1974
Bock, H.; Solouki, B.,
Photoelektronenspektren und molekuleigenschaften, XXXV. Sulfoxide X2SO - beispiele fur den nutzen von korrelations - diagrammen bei der diskussion von substituenteneffekten und von geometrischen storungen,
Chem. Ber., 1974, 107, 2299. [all data]
Mines, Thomas, et al., 1972
Mines, G.W.; Thomas, R.K.; Thompson, H.,
Photoelectron spectra of compounds containing thionyl and sulphuryl groups,
Proc. R. Soc. London A:, 1972, 329, 275. [all data]
Bock and Solouki, 1972
Bock, H.; Solouki, B.,
The sulfoxide bond,
Angew. Chem. Int. Ed. Engl., 1972, 11, 436. [all data]
Zha, Nishimura, et al., 1988
Zha, Q.; Nishimura, T.; Meisels, G.G.,
Unimolecular dissociation of energy-selected dimethyl sulfoxide,
Int. J. Mass Spectrom. Ion Processes, 1988, 83, 1. [all data]
Amos, Gillis, et al., 1969
Amos, D.; Gillis, R.G.; Occolowitz, J.L.; Pisani, J.F.,
The ions [CH3S]+, [C2H5S]+ and [CH3O]+ formed by electron-impact,
Org. Mass Spectrom., 1969, 2, 209. [all data]
Huber, Kenndler, et al., 1993
Huber, J.F.K.; Kenndler, E.; Reich, G.; Hack, W.; Wolf, J.,
Optimal Selection of Gas Chromatographic Columns for the Analytical Control of Chemical Warfare Agents by Application of Information Theory to Retention Data,
Anal. Chem., 1993, 65, 20, 2903-2906, https://doi.org/10.1021/ac00068a031
. [all data]
Hancock and Peters, 1991
Hancock, J.R.; Peters, G.R.,
Retention index monitoring of compounds of chemical defence interest using thermal desorption gas chromatography,
J. Chromatogr., 1991, 538, 2, 249-257, https://doi.org/10.1016/S0021-9673(01)88845-2
. [all data]
D'Agostino and Provost, 1985
D'Agostino, P.A.; Provost, L.R.,
Gas chromatographic retention indices of chemical warfare agents and simulants,
J. Chromatogr., 1985, 331, 47-54, https://doi.org/10.1016/0021-9673(85)80005-4
. [all data]
Cros, Lignot, et al., 2005
Cros, S.; Lignot, B.; Bourseau, P.; Jaouen, P.; Prost, C.,
Desalination of mussel cooking juices by electrodialysis: effect on the aroma profile,
J. Food Eng., 2005, 69, 4, 425-436, https://doi.org/10.1016/j.jfoodeng.2004.08.036
. [all data]
Cros, Vandanjon, et al., 2003
Cros, S.; Vandanjon, L.; Jaouen, P.; Bourseau, P.,
Processing of industrial mussel cooking juices by reverse osmosis: pollution abatement and aromas recovery, 2003, retrieved from http://www.membrane.unsw.edu.au/imstec03/content/papers/DAI/imstec064.pdf. [all data]
Chung, 1999
Chung, H.Y.,
Volatile components in crabmeats of Charybdis feriatus,
J. Agric. Food Chem., 1999, 47, 6, 2280-2287, https://doi.org/10.1021/jf981027t
. [all data]
Zenkevich, 2005
Zenkevich, I.G.,
Experimentally measured retention indices., 2005. [all data]
Valette, Fernandez, et al., 2003
Valette, L.; Fernandez, X.; Poulain, S.; Loiseau, A.-M.; Lizzani-Cuvelier, L.; Levieil, R.; Restier, L.,
Volatile constituents from Romanesco cauliflower,
Food Chem., 2003, 80, 3, 353-358, https://doi.org/10.1016/S0308-8146(02)00272-8
. [all data]
Iraqi, Vermeulen, et al., 2005
Iraqi, R.; Vermeulen, C.; Benzekri, A.; Bouseta, A.; Collin, S.,
Screening for key odorants in Moroccan green olives by gas chromatography-olfactometry/aroma extract dilution analysis,
J. Agric. Food Chem., 2005, 53, 4, 1179-1184, https://doi.org/10.1021/jf040349w
. [all data]
Begnaud, Pérès, et al., 2003
Begnaud, F.; Pérès, C.; Berdagué, J.-L.,
Characterization of volatile effluents of livestock buildings by solid-phase microextraction,
Int. J. Environ. Anal. Chem., 2003, 83, 10, 837-849, https://doi.org/10.1080/03067310310001603349
. [all data]
Flanagan, Streete, et al., 1997
Flanagan, R.J.; Streete, P.J.; Ramsey, J.D.,
Volatile Substance Abuse, UNODC Technical Series, No 5, United Nations, Office on Drugs and Crime, Vienna International Centre, PO Box 500, A-1400 Vienna, Austria, 1997, 56, retrieved from http://www.odccp.org/pdf/technicalseries1997-01-011.pdf. [all data]
Strete, Ruprah, et al., 1992
Strete, P.J.; Ruprah, M.; Ramsey, J.D.; Flanagan, R.J.,
Detection and identification of volatile substances by headspace capillary gas chromatography to aid the diagnosis of acute poisoning,
Analyst, 1992, 117, 7, 1111-1127, https://doi.org/10.1039/an9921701111
. [all data]
Waggott and Davies, 1984
Waggott, A.; Davies, I.W.,
Identification of organic pollutants using linear temperature programmed retention indices (LTPRIs) - Part II, 1984, retrieved from http://dwi.defra.gov.uk/research/completed-research/reports/dwi0383.pdf. [all data]
Puvipirom and Chaisei, 2012
Puvipirom, J.; Chaisei, S.,
Contribution of roasted grains and seeds in aroma of oleang (Thai coffee drink),
Int. Food Res. J., 2012, 19, 2, 583-588. [all data]
Soria, Sanz, et al., 2008
Soria, A.C.; Sanz, J.; Martinez-Castro, I.,
SPME followed by GC-MS: a powerful technique for qualitative analysis of honey volatiles,
Eur. Food Res. Technol., 2008, 1-12. [all data]
Cros, Vandanjon, et al., 2007
Cros, S.; Vandanjon, L.; Jaouen, P.; Bourseau, P.,
Processing of Industrial Mussel Cooking Juices by Reverse Osmotis: Pollution Abatement and Aromas Recovery, 2007, retrieved from title of Internet file: [imstec064]. [all data]
Prososki, Etzel, et al., 2007
Prososki, R.A.; Etzel, M.R.; Rankin, S.A.,
Solvent type affects the number, distribution, and relative quantities of volatile compounds found in sweet whey powder,
J. Dairy Sci., 2007, 90, 2, 523-531, https://doi.org/10.3168/jds.S0022-0302(07)71535-7
. [all data]
Soria, Gonzalez, et al., 2004
Soria, A.C.; Gonzalez, M.; de Lorenzo, C.; Martinez-Castro, I.; Sanza, J.,
Characterization of artisanal honeys from Madrid (Central Spain) on the basis of their melissopalynological, physicochemical and volatile composition data,
Food Chem., 2004, 85, 1, 121-130, https://doi.org/10.1016/j.foodchem.2003.06.012
. [all data]
Cros, Vandanjon, et al., 2003, 2
Cros, S.; Vandanjon, L.; Jaouen, P.; Bourseau, P.,
IMSTEC'03 Conference Proceedings, Processing of industrial mussel cooking juices by reverse osmosis: pollution abatement and aromas recovery, Universoty of New South Wales, Sydney, Australia, 2003, 6. [all data]
Wei, Mura, et al., 2001
Wei, A.; Mura, K.; Shibamoto, T.,
Antioxidative activity of volatile chemicals extracted from beer,
J. Agric. Food Chem., 2001, 49, 8, 4097-4101, https://doi.org/10.1021/jf010325e
. [all data]
Iwatsuki, Mizota, et al., 1999
Iwatsuki, K.; Mizota, Y.; Kubota, T.; Nishimura, O.; Masuda, H.; Sotoyama, K.; Tomita, M.,
Aroma extract dilution analysis. Evluation of aroma of pasteurized and UHT processed milk by aroma extract dilution analysis,
Nippon Shokuhin Kagaku Kogaku Kaishi, 1999, 46, 9, 587-597, https://doi.org/10.3136/nskkk.46.587
. [all data]
Johanningsmeier and McFeeters, 2011
Johanningsmeier, S.D.; McFeeters, R.F.,
Detection of volatile spoilage metabolites in fermented cucumbers using nontargeted, comprehensive 2-dimensional gas chromatography-time-of-flight mass spectrometry (GCxGCxTOFMS),
J. Food Sci., 2011, 76, 1, c168-c177, https://doi.org/10.1111/j.1750-3841.2010.01918.x
. [all data]
Mebazaa, Mahmoudi, et al., 2009
Mebazaa, R.; Mahmoudi, A.; Fouchet, M.; Dos Santos, M.; Kamissoko, F.; Nafti, A.; Ben Cheikh, R.; Rega, B.; Camel, V.,
Characterization of volatile compounds in Tunisian fenugreek seeds,
Food Chem., 2009, 115, 4, 1326-1336, https://doi.org/10.1016/j.foodchem.2009.01.066
. [all data]
Kaack and Christensen, 2008
Kaack, K.; Christensen, L.P.,
Effect of packing materials and storage time on volatile compounds in tea processes from flowers of black elder (Sambucus nigra L.),
Eur. Food Res. Technol., 2008, 227, 4, 1259-1273, https://doi.org/10.1007/s00217-008-0844-8
. [all data]
Kim. J.H., Ahn, et al., 2004
Kim. J.H.; Ahn, H.J.; Yook, H.S.; Kim, K.S.; Rhee, M.S.; Ryu, G.H.; Byun, M.W.,
Color, flavor, and sensory characteristics of gamma-irradiated salted and fermented anchovy sauce,
Radiation Phys. Chem., 2004, 69, 2, 179-187, https://doi.org/10.1016/S0969-806X(03)00400-6
. [all data]
Vinogradov, 2004
Vinogradov, B.A.,
Production, composition, properties and application of essential oils, 2004, retrieved from http://viness.narod.ru. [all data]