Dimolybdenum,tetrakis[μ-(6-methyl-2(1H)-pyridinonato-]
- Formula: C24H24Mo2N4O4
- Molecular weight: 624.39
- CAS Registry Number: 67634-80-4

Condensed phase thermochemistry data

Data compiled by: José A. Martinho Simões
Quantity | Value | Units | Method | Reference | Comment |
---|---|---|---|---|---|
ΔfH°solid | -751. ± 12. | kJ/mol | Review | Martinho Simões |

Phase change data

Data compiled as indicated in comments:
AC - William E. Acree, Jr., James S. Chickos
MS - José A. Martinho Simões
Quantity | Value | Units | Method | Reference | Comment |
---|---|---|---|---|---|
ΔsubH° | 157.0 ± 3.0 | kJ/mol | N/A | Pilcher and Skinner, 1983 | See also Cavell, Garner, et al., 1981.; AC |
ΔsubH° | 157.0 ± 3.0 | kJ/mol | RSC | Cavell, Garner, et al., 1981 | MS |

Gas phase ion energetics data

Data compiled as indicated in comments:
LLK - Sharon G. Lias, Rhoda D. Levin, and Sherif A. Kafafi
Ionization energy determinations
IE (eV) | Method | Reference | Comment |
---|---|---|---|
5.5 | PE | Bursten, Cotton, et al., 1979 | LLK |
5.89 | PE | Bursten, Cotton, et al., 1979 | Vertical value; LLK |

Gas phase thermochemistry data

Data compiled by: José A. Martinho Simões
Quantity | Value | Units | Method | Reference | Comment |
---|---|---|---|---|---|
ΔfH°gas | -594. ± 13. | kJ/mol | Review | Martinho Simões |

References

Martinho Simões
Martinho Simões, J.A.,
Private communication (see http://webbook.nist.gov/chemistry/om/). [all data]
Pilcher and Skinner, 1983
Pilcher, G.; Skinner, H.A.,
Thermochemistry of organometallic compounds, 1983, 43-90, https://doi.org/10.1002/9780470771686.ch2
. [all data]
Cavell, Garner, et al., 1981
Cavell, K.J.; Garner, C.D.; Martinho-Simoes, J.A.; Pilcher, G.; Al-Samman, H.; Skinner, H.A.; Al-Tekhin, G.; Walton, I.B.; Zafarani-Moattar, M.T.,
J. Chem. Soc. Faraday Trans. 1, 1981, 77, 2927. [all data]
Bursten, Cotton, et al., 1979
Bursten, B.E.; Cotton, F.A.; Cowley, A.H.; Hanson, B.E.; Lattman, M.; Stanley, G.S.,
Strong metal-to-metal quadruple bonds in a series of five isostructural compounds as indicated by photoelectron spectroscopy,
J. Am. Chem. Soc., 1979, 101, 6244. [all data]