Isopropyl Alcohol
- Formula: C3H8O
- Molecular weight: 60.0950
- IUPAC Standard InChIKey: KFZMGEQAYNKOFK-UHFFFAOYSA-N
- CAS Registry Number: 67-63-0
- Chemical structure:
View 3d structure (requires JavaScript / HTML 5) - Other names: 2-Propanol; sec-Propyl Alcohol; Alcojel; Alcosolve 2; Avantin; Avantine; Combi-Schutz; Dimethylcarbinol; Hartosol; Imsol A; Isohol; Isopropanol; Lutosol; Petrohol; Propol; PRO; Takineocol; 1-Methylethyl Alcohol; iso-C3H7OH; 2-Hydroxypropane; Propane, 2-hydroxy-; sec-Propanol; Propan-2-ol; i-Propylalkohol; Alcolo; Alcool isopropilico; Alcool isopropylique; Alkolave; Arquad DMCB; iso-Propylalkohol; Isopropyl alcohol, rubbing; IPA; Lavacol; Visco 1152; Alcosolve; i-Propanol; 2-Propyl alcohol; Spectrar; Sterisol hand disinfectant; UN 1219; n-Propan-2-ol; 1-methylethanol; Propanol-2; Virahol; IPS 1

Gas phase thermochemistry data

Data compiled as indicated in comments:
ALS - Hussein Y. Afeefy, Joel F. Liebman, and Stephen E. Stein
DRB - Donald R. Burgess, Jr.
GT - Glushko Thermocenter, Russian Academy of Sciences, Moscow
Quantity | Value | Units | Method | Reference | Comment |
---|---|---|---|---|---|
ΔfH°gas | -272.8 | kJ/mol | Eqk | Buckley and Herington, 1965 | ALS |
ΔfH°gas | -271.1 | kJ/mol | N/A | Chao and Rossini, 1965 | Value computed using ΔfHliquid° value of -317.0±0.3 kj/mol from Chao and Rossini, 1965 and ΔvapH° value of 45.9 kj/mol from Snelson and Skinner, 1961.; DRB |
ΔfH°gas | -272.3 ± 0.92 | kJ/mol | Ccb | Snelson and Skinner, 1961 | ALS |
ΔfH°gas | -272.8 | kJ/mol | N/A | Parks, Mosley, et al., 1950 | Value computed using ΔfHliquid° value of -318.7 kj/mol from Parks, Mosley, et al., 1950 and ΔvapH° value of 45.9 kj/mol from Snelson and Skinner, 1961.; DRB |
Constant pressure heat capacity of gas
Cp,gas (J/mol*K) | Temperature (K) | Reference | Comment |
---|---|---|---|
35.32 | 50. | Thermodynamics Research Center, 1997 | p=1 bar. Discrepancies with other statistically calculated values [ Green J.H.S., 1963] and [51KOB] increase at high temperatures up to 5 and 9 J/mol*K, respectively, in Cp(T). There is a good agreement with results [ Chao J., 1986]. Please also see Chao J., 1986, 2.; GT |
46.04 | 100. | ||
57.98 | 150. | ||
68.28 | 200. | ||
83.72 | 273.15 | ||
89.32 ± 0.15 | 298.15 | ||
89.74 | 300. | ||
112.15 | 400. | ||
131.96 | 500. | ||
148.30 | 600. | ||
161.75 | 700. | ||
173.04 | 800. | ||
182.67 | 900. | ||
190.97 | 1000. | ||
198.16 | 1100. | ||
204.41 | 1200. | ||
209.85 | 1300. | ||
214.60 | 1400. | ||
218.75 | 1500. | ||
227.0 | 1750. | ||
233.1 | 2000. | ||
237.6 | 2250. | ||
241.0 | 2500. | ||
243.7 | 2750. | ||
245.7 | 3000. |
Constant pressure heat capacity of gas
Cp,gas (J/mol*K) | Temperature (K) | Reference | Comment |
---|---|---|---|
103.06 | 358.72 | Stromsoe E., 1970 | Ideal gas heat capacities are given by [ Stromsoe E., 1970] as a linear function Cp=f1*(a+bT). This expression approximates the experimental values with the average deviation of 1.59 J/mol*K. The accuracy of the experimental heat capacities [ Stromsoe E., 1970] is estimated as less than 0.3%. Other experimental values of Cp [ Parks G.S., 1940] (118.83 at 427.9 K, 127.61 at 457.7 K, and 135.56 J/mol*K at 480.3 K) are believed to be less reliable. Please also see Hales J.L., 1963, Berman N.S., 1964.; GT |
105.7 ± 1.6 | 365.75 | ||
105.77 | 371.15 | ||
106.29 | 373.15 | ||
108.1 ± 1.6 | 378.85 | ||
109.2 ± 1.6 | 384.95 | ||
110.08 | 391.15 | ||
110.8 ± 1.6 | 393.65 | ||
111.65 | 398.15 | ||
113.0 ± 1.6 | 405.35 | ||
114.35 | 411.15 | ||
117.02 | 423.15 | ||
118.70 | 431.15 | ||
122.10 | 448.15 | ||
122.80 | 451.15 | ||
121.7 ± 1.6 | 453.15 | ||
124.2 ± 1.6 | 466.75 | ||
127.01 | 473.15 | ||
126.7 ± 1.6 | 480.55 | ||
130.3 ± 1.6 | 499.75 | ||
132.9 ± 1.6 | 513.95 | ||
137.5 ± 1.6 | 539.05 | ||
142.6 ± 1.6 | 567.05 | ||
148.1 ± 1.6 | 597.25 |

Condensed phase thermochemistry data

Data compiled as indicated in comments:
ALS - Hussein Y. Afeefy, Joel F. Liebman, and Stephen E. Stein
DH - Eugene S. Domalski and Elizabeth D. Hearing
Quantity | Value | Units | Method | Reference | Comment |
---|---|---|---|---|---|
ΔfH°liquid | -317.0 ± 0.3 | kJ/mol | Ccb | Chao and Rossini, 1965 | see Rossini, 1934; ALS |
ΔfH°liquid | -318.2 ± 0.71 | kJ/mol | Ccb | Snelson and Skinner, 1961 | ALS |
ΔfH°liquid | -318.7 | kJ/mol | Ccb | Parks, Mosley, et al., 1950 | see Parks and Moore, 1939; ALS |
Quantity | Value | Units | Method | Reference | Comment |
ΔcH°liquid | -2006.9 ± 0.2 | kJ/mol | Ccb | Chao and Rossini, 1965 | see Rossini, 1934; Corresponding ΔfHºliquid = -316.9 kJ/mol (simple calculation by NIST; no Washburn corrections); ALS |
ΔcH°liquid | -2005.8 ± 0.4 | kJ/mol | Ccb | Snelson and Skinner, 1961 | Corresponding ΔfHºliquid = -318.1 kJ/mol (simple calculation by NIST; no Washburn corrections); ALS |
ΔcH°liquid | -2005.1 | kJ/mol | Ccb | Parks, Mosley, et al., 1950 | see Parks and Moore, 1939; Corresponding ΔfHºliquid = -318.7 kJ/mol (simple calculation by NIST; no Washburn corrections); ALS |
Quantity | Value | Units | Method | Reference | Comment |
S°liquid | 180.58 | J/mol*K | N/A | Andon, Counsell, et al., 1963 | DH |
S°liquid | 179.9 | J/mol*K | N/A | Kelley, 1929 | DH |
S°liquid | 192.9 | J/mol*K | N/A | Parks and Kelley, 1928 | Extrapolation below 70 K, 43.56 J/mol*K.; DH |
S°liquid | 190.8 | J/mol*K | N/A | Parks and Kelley, 1925 | Extrapolation below 90 K, 53.22 J/mol*K.; DH |
Constant pressure heat capacity of liquid
Cp,liquid (J/mol*K) | Temperature (K) | Reference | Comment |
---|---|---|---|
161.2 | 298.15 | Roux, Roberts, et al., 1980 | DH |
154.75 | 298.15 | Brown and Ziegler, 1979 | T = 185 to 304 K. Results as equation only.; DH |
165.6 | 311.6 | Griigo'ev, Yanin, et al., 1979 | T = 311 to 453 K. p = 0.98 bar.; DH |
154.43 | 298.15 | Andon, Counsell, et al., 1963 | T = 10 to 330 K.; DH |
162.8 | 298.2 | Katayama, 1962 | T = 10 to 60°C.; DH |
180.3 | 324. | Swietoslawski and Zielenkiewicz, 1958 | Mean value 21 to 81°C.; DH |
154.0 | 298. | Ginnings and Corruccini, 1948 | T = 0 to 200°C.; DH |
159.99 | 298.04 | Zhdanov, 1945 | T = 7 to 41°C. Value is unsmoothed experimental datum.; DH |
172.4 | 303.2 | Phillip, 1939 | DH |
163.6 | 298. | Trew and Watkins, 1933 | DH |
149.75 | 292.84 | Kelley, 1929 | T = 16 to 298 K. Value is unsmoothed experimental datum.; DH |
180.3 | 298.1 | Parks, Kelley, et al., 1929 | Extrapolation below 90 K, 42.68 J/mol*K.; DH |
151.0 | 293.1 | Parks and Kelley, 1928 | T = 71 to 293 K. Value is unsmoothed experimental datum.; DH |
152.3 | 293.1 | Parks and Kelley, 1925 | T = 71 to 293 K. Value is unsmoothed experimental datum.; DH |
169.9 | 303. | Willams and Daniels, 1924 | T = 303 to 323 K. Equation only.; DH |

Phase change data

Data compiled as indicated in comments:
TRC - Thermodynamics Research Center, NIST Boulder Laboratories, Chris Muzny director
BS - Robert L. Brown and Stephen E. Stein
AC - William E. Acree, Jr., James S. Chickos
ALS - Hussein Y. Afeefy, Joel F. Liebman, and Stephen E. Stein
DH - Eugene S. Domalski and Elizabeth D. Hearing
Quantity | Value | Units | Method | Reference | Comment |
---|---|---|---|---|---|
Tboil | 355.5 ± 0.4 | K | AVG | N/A | Average of 102 out of 118 values; Individual data points |
Quantity | Value | Units | Method | Reference | Comment |
Tfus | 185.75 | K | N/A | Ogimachi, Corcoran, et al., 1961 | Uncertainty assigned by TRC = 0.5 K; TRC |
Tfus | 185.35 | K | N/A | Anonymous, 1958 | TRC |
Quantity | Value | Units | Method | Reference | Comment |
Ttriple | 184.9 ± 0.6 | K | AVG | N/A | Average of 6 values; Individual data points |
Quantity | Value | Units | Method | Reference | Comment |
Tc | 509. ± 2. | K | AVG | N/A | Average of 19 out of 20 values; Individual data points |
Quantity | Value | Units | Method | Reference | Comment |
Pc | 49. ± 5. | bar | AVG | N/A | Average of 10 values; Individual data points |
Quantity | Value | Units | Method | Reference | Comment |
Vc | 0.222 | l/mol | N/A | Gude and Teja, 1995 | |
Vc | 0.223 | l/mol | N/A | Ambrose, Counsell, et al., 1978 | Uncertainty assigned by TRC = 0.003 l/mol; PVT compatible with values chosen.; TRC |
Quantity | Value | Units | Method | Reference | Comment |
ρc | 4.51 ± 0.02 | mol/l | N/A | Gude and Teja, 1995 | |
ρc | 4.54 | mol/l | N/A | Teja, Lee, et al., 1989 | TRC |
ρc | 4.538 | mol/l | N/A | Ambrose and Townsend, 1963 | TRC |
Quantity | Value | Units | Method | Reference | Comment |
ΔvapH° | 45. ± 3. | kJ/mol | AVG | N/A | Average of 11 values; Individual data points |
Enthalpy of vaporization
ΔvapH (kJ/mol) | Temperature (K) | Method | Reference | Comment |
---|---|---|---|---|
39.85 | 355.4 | N/A | Majer and Svoboda, 1985 | |
43.2 | 337. | N/A | Segura, Galindo, et al., 2002 | Based on data from 322. to 355. K.; AC |
39.8 | 355. | N/A | Wormald and Vine, 2000 | AC |
29.7 | 423. | N/A | Wormald and Vine, 2000 | AC |
23.7 | 453. | N/A | Wormald and Vine, 2000 | AC |
16.5 | 483. | N/A | Wormald and Vine, 2000 | AC |
10.5 | 503. | N/A | Wormald and Vine, 2000 | AC |
44.8 | 315. | N/A | Aucejo, Gonzalez-Alfaro, et al., 1995 | Based on data from 300. to 355. K.; AC |
50.3 | 213. | A | Stephenson and Malanowski, 1987 | Based on data from 195. to 228. K.; AC |
42.0 | 355. | A | Stephenson and Malanowski, 1987 | Based on data from 347. to 368. K.; AC |
41.3 | 365. | A | Stephenson and Malanowski, 1987 | Based on data from 350. to 383. K.; AC |
39.2 | 394. | A | Stephenson and Malanowski, 1987 | Based on data from 379. to 461. K.; AC |
35.3 | 468. | A | Stephenson and Malanowski, 1987 | Based on data from 453. to 508. K.; AC |
43.1 | 340. | A,EB | Stephenson and Malanowski, 1987 | Based on data from 325. to 362. K. See also Ambrose, Counsell, et al., 1970.; AC |
45.7 | 288. | N/A | Wilhoit and Zwolinski, 1973 | Based on data from 273. to 374. K.; AC |
45.5 | 303. | N/A | Van Ness, Soczek, et al., 1967 | Based on data from 288. to 348. K.; AC |
42.7 ± 0.1 | 330. | C | Berman, Larkam, et al., 1964 | AC |
41.0 ± 0.1 | 346. | C | Berman, Larkam, et al., 1964 | AC |
39.8 ± 0.1 | 355. | C | Berman, Larkam, et al., 1964 | AC |
38.9 ± 0.1 | 363. | C | Berman, Larkam, et al., 1964 | AC |
39.1 | 410. | N/A | Ambrose and Townsend, 1963, 2 | Based on data from 395. to 508. K.; AC |
42.8 | 344. | EB | Biddiscombe, Collerson, et al., 1963 | Based on data from 329. to 363. K.; AC |
43.2 | 324. | C | Hales, Cox, et al., 1963 | AC |
41.7 | 339. | C | Hales, Cox, et al., 1963 | AC |
39.8 | 355. | C | Hales, Cox, et al., 1963 | AC |
43.40 ± 0.08 | 324.11 | V | Williamson and Harrison, 1957 | ALS |
41.1 | 369. | N/A | Foz Gazulla, Morcilio, et al., 1955 | Based on data from 354. to 420. K.; AC |
Enthalpy of vaporization
ΔvapH = A exp(-αTr)
(1 − Tr)β
ΔvapH =
Enthalpy of vaporization (at saturation pressure)
(kJ/mol)
Tr = reduced temperature (T / Tc)
View plot Requires a JavaScript / HTML 5 canvas capable browser.
Temperature (K) | 298. to 380. |
---|---|
A (kJ/mol) | 53.38 |
α | -0.708 |
β | 0.6538 |
Tc (K) | 508.3 |
Reference | Majer and Svoboda, 1985 |
Antoine Equation Parameters
log10(P) = A − (B / (T + C))
P = vapor pressure (bar)
T = temperature (K)
View plot Requires a JavaScript / HTML 5 canvas capable browser.
Temperature (K) | A | B | C | Reference | Comment |
---|---|---|---|---|---|
395.1 to 508.24 | 4.57795 | 1221.423 | -87.474 | Ambrose and Townsend, 1963, 3 | Coefficents calculated by NIST from author's data. |
329.92 to 362.41 | 4.8610 | 1357.427 | -75.814 | Biddiscombe, Collerson, et al., 1963, 2 | Coefficents calculated by NIST from author's data. |
Enthalpy of fusion
ΔfusH (kJ/mol) | Temperature (K) | Reference | Comment |
---|---|---|---|
5.410 | 185.20 | Andon, Counsell, et al., 1963 | DH |
5.372 | 184.67 | Kelley, 1929 | DH |
5.41 | 185.2 | Domalski and Hearing, 1996 | AC |
5.301 | 184.6 | Parks and Kelley, 1928 | DH |
5.297 | 184.6 | Parks and Kelley, 1925 | DH |
Entropy of fusion
ΔfusS (J/mol*K) | Temperature (K) | Reference | Comment |
---|---|---|---|
29.21 | 185.20 | Andon, Counsell, et al., 1963 | DH |
29.09 | 184.67 | Kelley, 1929 | DH |
28.72 | 184.6 | Parks and Kelley, 1928 | DH |
28.7 | 184.6 | Parks and Kelley, 1925 | DH |

Reaction thermochemistry data

Data compiled as indicated in comments:
B - John E. Bartmess
M - Michael M. Meot-Ner (Mautner) and Sharon G. Lias
ALS - Hussein Y. Afeefy, Joel F. Liebman, and Stephen E. Stein
RCD - Robert C. Dunbar
Individual Reactions
C3H7O- + =
By formula: C3H7O- + H+ = C3H8O
Quantity | Value | Units | Method | Reference | Comment |
---|---|---|---|---|---|
ΔrH° | 1569. ± 4.2 | kJ/mol | D-EA | Ramond, Davico, et al., 2000 | gas phase; B |
ΔrH° | 1571. ± 8.8 | kJ/mol | G+TS | Bartmess, Scott, et al., 1979 | gas phase; value altered from reference due to change in acidity scale; B |
ΔrH° | 1576. ± 4.2 | kJ/mol | CIDT | DeTuri and Ervin, 1999 | gas phase; B |
ΔrH° | 1572. ± 8.4 | kJ/mol | CIDC | Haas and Harrison, 1993 | gas phase; Both metastable and 50 eV collision energy.; B |
Quantity | Value | Units | Method | Reference | Comment |
ΔrG° | 1542. ± 4.6 | kJ/mol | H-TS | Ramond, Davico, et al., 2000 | gas phase; B |
ΔrG° | 1543. ± 8.4 | kJ/mol | IMRE | Bartmess, Scott, et al., 1979 | gas phase; value altered from reference due to change in acidity scale; B |
ΔrG° | 1544. ± 8.8 | kJ/mol | H-TS | Haas and Harrison, 1993 | gas phase; Both metastable and 50 eV collision energy.; B |
By formula: Cl- + C3H8O = (Cl- • C3H8O)
Quantity | Value | Units | Method | Reference | Comment |
---|---|---|---|---|---|
ΔrH° | 81.17 ± 0.84 | kJ/mol | TDAs | Bogdanov, Peschke, et al., 1999 | gas phase; B |
ΔrH° | 76.6 ± 4.2 | kJ/mol | TDAs | Hiraoka and Mizuse, 1987 | gas phase; B,M |
ΔrH° | 73.6 ± 8.4 | kJ/mol | IMRE | Larson and McMahon, 1984 | gas phase; B,M |
Quantity | Value | Units | Method | Reference | Comment |
ΔrS° | 103. | J/mol*K | PHPMS | Hiraoka and Mizuse, 1987 | gas phase; M |
ΔrS° | 97.1 | J/mol*K | N/A | Larson and McMahon, 1984 | gas phase; switching reaction(cl-)t-C4H9OH, Entropy change calculated or estimated; Larson and McMahon, 1984, 2; M |
Quantity | Value | Units | Method | Reference | Comment |
ΔrG° | 47.36 | kJ/mol | TDAs | Bogdanov, Peschke, et al., 1999 | gas phase; B |
ΔrG° | 45.61 | kJ/mol | TDAs | Hiraoka and Mizuse, 1987 | gas phase; B |
ΔrG° | 44.8 ± 8.4 | kJ/mol | IMRE | Larson and McMahon, 1984 | gas phase; B,M |
By formula: C2H7O+ + C3H8O = (C2H7O+ • C3H8O)
Bond type: Hydrogen bonds of the type OH-O between organics
Quantity | Value | Units | Method | Reference | Comment |
---|---|---|---|---|---|
ΔrH° | 133. | kJ/mol | ICR | Bomse and Beauchamp, 1981 | gas phase; switching reaction((CH3)2OH+)(CH3)2O, Entropy change calculated or estimated; Grimsrud and Kebarle, 1973, Lias, Liebman, et al., 1984; M |
Quantity | Value | Units | Method | Reference | Comment |
ΔrS° | 124. | J/mol*K | N/A | Bomse and Beauchamp, 1981 | gas phase; switching reaction((CH3)2OH+)(CH3)2O, Entropy change calculated or estimated; Grimsrud and Kebarle, 1973, Lias, Liebman, et al., 1984; M |
Quantity | Value | Units | Method | Reference | Comment |
ΔrG° | 96.7 | kJ/mol | ICR | Bomse and Beauchamp, 1981 | gas phase; switching reaction((CH3)2OH+)(CH3)2O, Entropy change calculated or estimated; Grimsrud and Kebarle, 1973, Lias, Liebman, et al., 1984; M |
By formula: C3H9O+ + C3H8O = (C3H9O+ • C3H8O)
Bond type: Hydrogen bonds of the type OH-O between organics
Quantity | Value | Units | Method | Reference | Comment |
---|---|---|---|---|---|
ΔrH° | 133. | kJ/mol | ICR | Bomse and Beauchamp, 1981 | gas phase; switching reaction((CH3)2OH+)(CH3)2O, Entropy change calculated or estimated; Grimsrud and Kebarle, 1973, Lias, Liebman, et al., 1984; M |
Quantity | Value | Units | Method | Reference | Comment |
ΔrS° | 124. | J/mol*K | N/A | Bomse and Beauchamp, 1981 | gas phase; switching reaction((CH3)2OH+)(CH3)2O, Entropy change calculated or estimated; Grimsrud and Kebarle, 1973, Lias, Liebman, et al., 1984; M |
Quantity | Value | Units | Method | Reference | Comment |
ΔrG° | 96.7 | kJ/mol | ICR | Bomse and Beauchamp, 1981 | gas phase; switching reaction((CH3)2OH+)(CH3)2O, Entropy change calculated or estimated; Grimsrud and Kebarle, 1973, Lias, Liebman, et al., 1984; M |
By formula: C4H11O+ + C3H8O = (C4H11O+ • C3H8O)
Bond type: Hydrogen bonds of the type OH-O between organics
Quantity | Value | Units | Method | Reference | Comment |
---|---|---|---|---|---|
ΔrH° | 128. | kJ/mol | ICR | Bomse and Beauchamp, 1981 | gas phase; switching reaction((CH3)2OH+)(CH3)2O, Entropy change calculated or estimated; Grimsrud and Kebarle, 1973, Lias, Liebman, et al., 1984; M |
Quantity | Value | Units | Method | Reference | Comment |
ΔrS° | 118. | J/mol*K | N/A | Bomse and Beauchamp, 1981 | gas phase; switching reaction((CH3)2OH+)(CH3)2O, Entropy change calculated or estimated; Grimsrud and Kebarle, 1973, Lias, Liebman, et al., 1984; M |
Quantity | Value | Units | Method | Reference | Comment |
ΔrG° | 92.5 | kJ/mol | ICR | Bomse and Beauchamp, 1981 | gas phase; switching reaction((CH3)2OH+)(CH3)2O, Entropy change calculated or estimated; Grimsrud and Kebarle, 1973, Lias, Liebman, et al., 1984; M |
By formula: C4H11O+ + C3H8O = (C4H11O+ • C3H8O)
Bond type: Hydrogen bonds of the type OH-O between organics
Quantity | Value | Units | Method | Reference | Comment |
---|---|---|---|---|---|
ΔrH° | 134. | kJ/mol | ICR | Bomse and Beauchamp, 1981 | gas phase; switching reaction((CH3)2OH+)(CH3)2O, Entropy change calculated or estimated; Grimsrud and Kebarle, 1973, Lias, Liebman, et al., 1984; M |
Quantity | Value | Units | Method | Reference | Comment |
ΔrS° | 115. | J/mol*K | N/A | Bomse and Beauchamp, 1981 | gas phase; switching reaction((CH3)2OH+)(CH3)2O, Entropy change calculated or estimated; Grimsrud and Kebarle, 1973, Lias, Liebman, et al., 1984; M |
Quantity | Value | Units | Method | Reference | Comment |
ΔrG° | 99.6 | kJ/mol | ICR | Bomse and Beauchamp, 1981 | gas phase; switching reaction((CH3)2OH+)(CH3)2O, Entropy change calculated or estimated; Grimsrud and Kebarle, 1973, Lias, Liebman, et al., 1984; M |
By formula: CN- + C3H8O = (CN- • C3H8O)
Quantity | Value | Units | Method | Reference | Comment |
---|---|---|---|---|---|
ΔrH° | 69.9 ± 3.3 | kJ/mol | TDAs | Larson, Szulejko, et al., 1988 | gas phase; B,M |
ΔrH° | 76. ± 15. | kJ/mol | IMRE | Larson and McMahon, 1987 | gas phase; B,M |
Quantity | Value | Units | Method | Reference | Comment |
ΔrS° | 110. | J/mol*K | PHPMS | Larson, Szulejko, et al., 1988 | gas phase; M |
ΔrS° | 104. | J/mol*K | N/A | Larson and McMahon, 1987 | gas phase; switching reaction,Thermochemical ladder(CN-)H2O, Entropy change calculated or estimated; Payzant, Yamdagni, et al., 1971; M |
Quantity | Value | Units | Method | Reference | Comment |
ΔrG° | 37.7 ± 0.84 | kJ/mol | TDAs | Larson, Szulejko, et al., 1988 | gas phase; B |
ΔrG° | 44.8 ± 9.6 | kJ/mol | IMRE | Larson and McMahon, 1987 | gas phase; B,M |
By formula: F- + C3H8O = (F- • C3H8O)
Quantity | Value | Units | Method | Reference | Comment |
---|---|---|---|---|---|
ΔrH° | 140.2 ± 2.9 | kJ/mol | TDAs | Bogdanov, Peschke, et al., 1999 | gas phase; B |
ΔrH° | 135. ± 8.4 | kJ/mol | IMRE | Larson and McMahon, 1983 | gas phase; B,M |
ΔrH° | 139. ± 9.2 | kJ/mol | CIDT | DeTuri and Ervin, 1999 | gas phase; B |
Quantity | Value | Units | Method | Reference | Comment |
ΔrS° | 107. | J/mol*K | N/A | Larson and McMahon, 1983 | gas phase; switching reaction(F-)H2O, Entropy change calculated or estimated; Arshadi, Yamdagni, et al., 1970; M |
Quantity | Value | Units | Method | Reference | Comment |
ΔrG° | 107.5 | kJ/mol | TDAs | Bogdanov, Peschke, et al., 1999 | gas phase; B |
ΔrG° | 103. ± 8.4 | kJ/mol | IMRE | Larson and McMahon, 1983 | gas phase; B,M |
By formula: C3H9Si+ + C3H8O = (C3H9Si+ • C3H8O)
Quantity | Value | Units | Method | Reference | Comment |
---|---|---|---|---|---|
ΔrH° | 184. | kJ/mol | PHPMS | Wojtyniak and Stone, 1986 | gas phase; switching reaction,Thermochemical ladder((CH3)3Si+)H2O, Entropy change calculated or estimated; M |
Quantity | Value | Units | Method | Reference | Comment |
ΔrS° | 129. | J/mol*K | N/A | Wojtyniak and Stone, 1986 | gas phase; switching reaction,Thermochemical ladder((CH3)3Si+)H2O, Entropy change calculated or estimated; M |
Free energy of reaction
ΔrG° (kJ/mol) | T (K) | Method | Reference | Comment |
---|---|---|---|---|
123. | 468. | PHPMS | Wojtyniak and Stone, 1986 | gas phase; switching reaction,Thermochemical ladder((CH3)3Si+)H2O, Entropy change calculated or estimated; M |
By formula: (Cl- • 2C3H8O) + C3H8O = (Cl- • 3C3H8O)
Quantity | Value | Units | Method | Reference | Comment |
---|---|---|---|---|---|
ΔrH° | 62.3 ± 2.1 | kJ/mol | TDAs | Bogdanov, Peschke, et al., 1999 | gas phase; B |
ΔrH° | 52.3 ± 4.2 | kJ/mol | TDAs | Hiraoka and Mizuse, 1987 | gas phase; B,M |
Quantity | Value | Units | Method | Reference | Comment |
ΔrS° | 109. | J/mol*K | PHPMS | Hiraoka and Mizuse, 1987 | gas phase; M |
Quantity | Value | Units | Method | Reference | Comment |
ΔrG° | 22.2 | kJ/mol | TDAs | Bogdanov, Peschke, et al., 1999 | gas phase; B |
ΔrG° | 20. ± 4.2 | kJ/mol | TDAs | Hiraoka and Mizuse, 1987 | gas phase; B |
By formula: (Cl- • C3H8O) + C3H8O = (Cl- • 2C3H8O)
Quantity | Value | Units | Method | Reference | Comment |
---|---|---|---|---|---|
ΔrH° | 69.9 ± 1.3 | kJ/mol | TDAs | Bogdanov, Peschke, et al., 1999 | gas phase; B |
ΔrH° | 65.3 ± 4.2 | kJ/mol | TDAs | Hiraoka and Mizuse, 1987 | gas phase; B,M |
Quantity | Value | Units | Method | Reference | Comment |
ΔrS° | 105. | J/mol*K | PHPMS | Hiraoka and Mizuse, 1987 | gas phase; M |
Quantity | Value | Units | Method | Reference | Comment |
ΔrG° | 32.1 | kJ/mol | TDAs | Bogdanov, Peschke, et al., 1999 | gas phase; B |
ΔrG° | 34. ± 4.2 | kJ/mol | TDAs | Hiraoka and Mizuse, 1987 | gas phase; B |
By formula: (Cl- • 7C3H8O) + C3H8O = (Cl- • 8C3H8O)
Quantity | Value | Units | Method | Reference | Comment |
---|---|---|---|---|---|
ΔrH° | 45.6 ± 4.2 | kJ/mol | TDAs | Hiraoka and Mizuse, 1987 | gas phase; Estimated entropy; single temperature measurement; B,M |
Quantity | Value | Units | Method | Reference | Comment |
ΔrS° | 130. | J/mol*K | N/A | Hiraoka and Mizuse, 1987 | gas phase; Entropy change calculated or estimated; M |
Quantity | Value | Units | Method | Reference | Comment |
ΔrG° | 6.7 ± 4.2 | kJ/mol | TDAs | Hiraoka and Mizuse, 1987 | gas phase; Estimated entropy; single temperature measurement; B |
By formula: I- + C3H8O = (I- • C3H8O)
Quantity | Value | Units | Method | Reference | Comment |
---|---|---|---|---|---|
ΔrH° | 54.81 ± 0.84 | kJ/mol | TDAs | Bogdanov, Peschke, et al., 1999 | gas phase; B |
ΔrH° | 51.0 ± 4.2 | kJ/mol | TDAs | Caldwell and Kebarle, 1984 | gas phase; B,M |
Quantity | Value | Units | Method | Reference | Comment |
ΔrS° | 79.9 | J/mol*K | PHPMS | Caldwell and Kebarle, 1984 | gas phase; M |
Quantity | Value | Units | Method | Reference | Comment |
ΔrG° | 26.5 | kJ/mol | TDAs | Bogdanov, Peschke, et al., 1999 | gas phase; B |
ΔrG° | 27. ± 4.2 | kJ/mol | TDAs | Caldwell and Kebarle, 1984 | gas phase; B |
By formula: H2 + C3H6O = C3H8O
Quantity | Value | Units | Method | Reference | Comment |
---|---|---|---|---|---|
ΔrH° | -68.74 ± 0.42 | kJ/mol | Cm | Wiberg, Crocker, et al., 1991 | liquid phase; ALS |
ΔrH° | -55.23 | kJ/mol | Eqk | Buckley and Herington, 1965 | gas phase; ALS |
ΔrH° | -55.40 ± 0.42 | kJ/mol | Chyd | Dolliver, Gresham, et al., 1938 | gas phase; Reanalyzed by Cox and Pilcher, 1970, Original value = -56.1 ± 0.4 kJ/mol; At 355 °K; ALS |
+
= C3H8BrO-
By formula: Br- + C3H8O = C3H8BrO-
Quantity | Value | Units | Method | Reference | Comment |
---|---|---|---|---|---|
ΔrH° | 60.25 ± 0.84 | kJ/mol | TDAs | Bogdanov, Peschke, et al., 1999 | gas phase; B |
Quantity | Value | Units | Method | Reference | Comment |
ΔrG° | 34.9 | kJ/mol | TDAs | Bogdanov, Peschke, et al., 1999 | gas phase; B |
ΔrG° | 38. ± 8.4 | kJ/mol | IMRE | Tanabe, Morgon, et al., 1996 | gas phase; Anchored to H2O..Br- of Hiraoka, Mizure, et al., 19882; B |
By formula: Na+ + C3H8O = (Na+ • C3H8O)
Quantity | Value | Units | Method | Reference | Comment |
---|---|---|---|---|---|
ΔrH° | 113. ± 4.2 | kJ/mol | CIDT | Armentrout and Rodgers, 2000 | RCD |
ΔrH° | 113. ± 4.6 | kJ/mol | CIDT | Rodgers and Armentrout, 1999 | RCD |
Free energy of reaction
ΔrG° (kJ/mol) | T (K) | Method | Reference | Comment |
---|---|---|---|---|
85.4 | 298. | IMRE | McMahon and Ohanessian, 2000 | Anchor alanine=39.89; RCD |
0.0 | 0. | CIDT | Rodgers and Armentrout, 1999 | RCD |
By formula: (Cl- • 3C3H8O) + C3H8O = (Cl- • 4C3H8O)
Quantity | Value | Units | Method | Reference | Comment |
---|---|---|---|---|---|
ΔrH° | 49.8 ± 4.2 | kJ/mol | TDAs | Hiraoka and Mizuse, 1987 | gas phase; B,M |
Quantity | Value | Units | Method | Reference | Comment |
ΔrS° | 120. | J/mol*K | PHPMS | Hiraoka and Mizuse, 1987 | gas phase; M |
Quantity | Value | Units | Method | Reference | Comment |
ΔrG° | 14. ± 4.2 | kJ/mol | TDAs | Hiraoka and Mizuse, 1987 | gas phase; B |
By formula: (Cl- • 4C3H8O) + C3H8O = (Cl- • 5C3H8O)
Quantity | Value | Units | Method | Reference | Comment |
---|---|---|---|---|---|
ΔrH° | 48.5 ± 4.2 | kJ/mol | TDAs | Hiraoka and Mizuse, 1987 | gas phase; B,M |
Quantity | Value | Units | Method | Reference | Comment |
ΔrS° | 128. | J/mol*K | PHPMS | Hiraoka and Mizuse, 1987 | gas phase; M |
Quantity | Value | Units | Method | Reference | Comment |
ΔrG° | 10. ± 4.2 | kJ/mol | TDAs | Hiraoka and Mizuse, 1987 | gas phase; B |
By formula: (Cl- • 5C3H8O) + C3H8O = (Cl- • 6C3H8O)
Quantity | Value | Units | Method | Reference | Comment |
---|---|---|---|---|---|
ΔrH° | 47.3 ± 4.2 | kJ/mol | TDAs | Hiraoka and Mizuse, 1987 | gas phase; B,M |
Quantity | Value | Units | Method | Reference | Comment |
ΔrS° | 130. | J/mol*K | PHPMS | Hiraoka and Mizuse, 1987 | gas phase; M |
Quantity | Value | Units | Method | Reference | Comment |
ΔrG° | 8.4 ± 4.2 | kJ/mol | TDAs | Hiraoka and Mizuse, 1987 | gas phase; B |
By formula: (Cl- • 6C3H8O) + C3H8O = (Cl- • 7C3H8O)
Quantity | Value | Units | Method | Reference | Comment |
---|---|---|---|---|---|
ΔrH° | 46.4 ± 4.2 | kJ/mol | TDAs | Hiraoka and Mizuse, 1987 | gas phase; B,M |
Quantity | Value | Units | Method | Reference | Comment |
ΔrS° | 131. | J/mol*K | PHPMS | Hiraoka and Mizuse, 1987 | gas phase; M |
Quantity | Value | Units | Method | Reference | Comment |
ΔrG° | 7.1 ± 4.2 | kJ/mol | TDAs | Hiraoka and Mizuse, 1987 | gas phase; B |
By formula: CH3S- + C3H8O = (CH3S- • C3H8O)
Quantity | Value | Units | Method | Reference | Comment |
---|---|---|---|---|---|
ΔrH° | 71.55 ± 0.84 | kJ/mol | TDAs | Sieck and Meot-ner, 1989 | gas phase; B,M |
Quantity | Value | Units | Method | Reference | Comment |
ΔrS° | 96.7 | J/mol*K | PHPMS | Sieck and Meot-ner, 1989 | gas phase; M |
Quantity | Value | Units | Method | Reference | Comment |
ΔrG° | 42.7 ± 3.3 | kJ/mol | TDAs | Sieck and Meot-ner, 1989 | gas phase; B |
+ 2
= C6H16FO2-
By formula: F- + 2C3H8O = C6H16FO2-
Quantity | Value | Units | Method | Reference | Comment |
---|---|---|---|---|---|
ΔrH° | 87.03 ± 0.84 | kJ/mol | TDAs | Bogdanov, Peschke, et al., 1999 | gas phase; B |
Quantity | Value | Units | Method | Reference | Comment |
ΔrG° | 55.48 | kJ/mol | TDAs | Bogdanov, Peschke, et al., 1999 | gas phase; B |
+
= C9H13OS-
By formula: C6H5S- + C3H8O = C9H13OS-
Quantity | Value | Units | Method | Reference | Comment |
---|---|---|---|---|---|
ΔrH° | 62.76 ± 0.42 | kJ/mol | TDAs | Sieck and Meot-ner, 1989 | gas phase; B |
Quantity | Value | Units | Method | Reference | Comment |
ΔrG° | 30.5 ± 1.7 | kJ/mol | TDAs | Sieck and Meot-ner, 1989 | gas phase; B |
+ 3
= C9H24FO3-
By formula: F- + 3C3H8O = C9H24FO3-
Quantity | Value | Units | Method | Reference | Comment |
---|---|---|---|---|---|
ΔrH° | 73.64 ± 0.84 | kJ/mol | TDAs | Bogdanov, Peschke, et al., 1999 | gas phase; B |
Quantity | Value | Units | Method | Reference | Comment |
ΔrG° | 35.0 | kJ/mol | TDAs | Bogdanov, Peschke, et al., 1999 | gas phase; B |
+ 2
= C6H16IO2-
By formula: I- + 2C3H8O = C6H16IO2-
Quantity | Value | Units | Method | Reference | Comment |
---|---|---|---|---|---|
ΔrH° | 46.0 ± 1.3 | kJ/mol | TDAs | Bogdanov, Peschke, et al., 1999 | gas phase; B |
Quantity | Value | Units | Method | Reference | Comment |
ΔrG° | 19.5 | kJ/mol | TDAs | Bogdanov, Peschke, et al., 1999 | gas phase; B |
+ 2
= C6H16BrO2-
By formula: Br- + 2C3H8O = C6H16BrO2-
Quantity | Value | Units | Method | Reference | Comment |
---|---|---|---|---|---|
ΔrH° | 51.46 ± 0.84 | kJ/mol | TDAs | Bogdanov, Peschke, et al., 1999 | gas phase; B |
Quantity | Value | Units | Method | Reference | Comment |
ΔrG° | 22.8 | kJ/mol | TDAs | Bogdanov, Peschke, et al., 1999 | gas phase; B |
+ 3
= C9H24IO3-
By formula: I- + 3C3H8O = C9H24IO3-
Quantity | Value | Units | Method | Reference | Comment |
---|---|---|---|---|---|
ΔrH° | 39.7 ± 2.9 | kJ/mol | TDAs | Bogdanov, Peschke, et al., 1999 | gas phase; B |
Quantity | Value | Units | Method | Reference | Comment |
ΔrG° | 14.8 | kJ/mol | TDAs | Bogdanov, Peschke, et al., 1999 | gas phase; B |
By formula: C4H8 + C3H8O = C7H16O
Quantity | Value | Units | Method | Reference | Comment |
---|---|---|---|---|---|
ΔrH° | -22.9 ± 1.3 | kJ/mol | Eqk | Calderon, Tejero, et al., 1997 | liquid phase; ALS |
ΔrH° | -21.7 ± 1.6 | kJ/mol | Cm | Sola, Pericas, et al., 1997 | liquid phase; ALS |
By formula: C3H8O = H2 + C3H6O
Quantity | Value | Units | Method | Reference | Comment |
---|---|---|---|---|---|
ΔrH° | 55.23 | kJ/mol | Eqk | Buckley and Herington, 1965 | gas phase; ALS |
ΔrH° | 56.543 | kJ/mol | Eqk | Kolb and Burwell, 1945 | gas phase; ALS |
+
= C3H7D8FO-
By formula: F- + C3H8O = C3H7D8FO-
Quantity | Value | Units | Method | Reference | Comment |
---|---|---|---|---|---|
ΔrG° | 102. ± 8.4 | kJ/mol | IMRE | Wilkinson, Szulejko, et al., 1992 | gas phase; Reported relative to ROH..F-, 0.5 kcal/mol weaker.; B |
By formula: Mg+ + C3H8O = (Mg+ • C3H8O)
Quantity | Value | Units | Method | Reference | Comment |
---|---|---|---|---|---|
ΔrH° | 270. ± 20. | kJ/mol | ICR | Operti, Tews, et al., 1988 | gas phase; switching reaction,Thermochemical ladder(Mg+)CH3OH; M |
By formula: C5H10O2 + H2O = C2H4O2 + C3H8O
Quantity | Value | Units | Method | Reference | Comment |
---|---|---|---|---|---|
ΔrH° | 2.3 ± 0.2 | kJ/mol | Cm | Wadso, 1958 | liquid phase; Heat of Hydrolysis; ALS |
By formula: C3H8O + C2HCl3O = 2,2,2-trichloro-1-isopropoxyethanol
Quantity | Value | Units | Method | Reference | Comment |
---|---|---|---|---|---|
ΔrH° | -41.6 | kJ/mol | Eqk | Jensen and Pedersen, 1971 | liquid phase; solvent: Heptane; ALS |
By formula: C6H12O + C3H6O = C6H10O + C3H8O
Quantity | Value | Units | Method | Reference | Comment |
---|---|---|---|---|---|
ΔrH° | 9.9 ± 1.9 | kJ/mol | Eqk | Fedoseenko, Yursha, et al., 1983 | gas phase; At 503 K; ALS |
+
= C5H8Cl2F2O
By formula: C3H8O + C2Cl2F2 = C5H8Cl2F2O
Quantity | Value | Units | Method | Reference | Comment |
---|---|---|---|---|---|
ΔrH° | -183. ± 1. | kJ/mol | Eqk | Kennedy, Lacher, et al., 1969 | gas phase; ALS |
By formula: C6H10O + C3H8O = C6H12O + C3H6O
Quantity | Value | Units | Method | Reference | Comment |
---|---|---|---|---|---|
ΔrH° | -9.9 ± 1.9 | kJ/mol | Eqk | Kabo, Yursha, et al., 1988 | gas phase; ALS |
By formula: C3H8O + HNO3 = C3H7NO3 + H2O
Quantity | Value | Units | Method | Reference | Comment |
---|---|---|---|---|---|
ΔrH° | -23.4 | kJ/mol | Eqk | Rubtsov, 1986 | liquid phase; ALS |
By formula: C2H2O + C3H8O = C5H10O2
Quantity | Value | Units | Method | Reference | Comment |
---|---|---|---|---|---|
ΔrH° | -150.2 | kJ/mol | Cm | Rice and Greenberg, 1934 | liquid phase; ALS |
By formula: Li+ + C3H8O = (Li+ • C3H8O)
Quantity | Value | Units | Method | Reference | Comment |
---|---|---|---|---|---|
ΔrH° | 173. ± 7.9 | kJ/mol | CIDT | Rodgers and Armentrout, 2000 | RCD |

Gas phase ion energetics data

Data evaluated as indicated in comments:
HL - Edward P. Hunter and Sharon G. Lias
L - Sharon G. Lias
Data compiled as indicated in comments:
B - John E. Bartmess
MM - Michael M. Meot-Ner (Mautner)
LBLHLM - Sharon G. Lias, John E. Bartmess, Joel F. Liebman, John L. Holmes, Rhoda D. Levin, and W. Gary Mallard
LLK - Sharon G. Lias, Rhoda D. Levin, and Sherif A. Kafafi
RDSH - Henry M. Rosenstock, Keith Draxl, Bruce W. Steiner, and John T. Herron
Quantity | Value | Units | Method | Reference | Comment |
---|---|---|---|---|---|
IE (evaluated) | 10.17 ± 0.02 | eV | N/A | N/A | L |
Quantity | Value | Units | Method | Reference | Comment |
Proton affinity (review) | 793.0 | kJ/mol | N/A | Hunter and Lias, 1998 | HL |
Quantity | Value | Units | Method | Reference | Comment |
Gas basicity | 762.6 | kJ/mol | N/A | Hunter and Lias, 1998 | HL |
Proton affinity at 298K
Proton affinity (kJ/mol) | Reference | Comment |
---|---|---|
796. ± 6. | Cao and Holmes, 2001 | MM |
Ionization energy determinations
IE (eV) | Method | Reference | Comment |
---|---|---|---|
10.15 ± 0.07 | EI | Bowen and Maccoll, 1984 | LBLHLM |
10.10 ± 0.02 | PI | Potapov and Sorokin, 1972 | LLK |
10.29 ± 0.02 | PE | Cocksey, Eland, et al., 1971 | LLK |
10.18 | PE | Dewar and Worley, 1969 | RDSH |
10.12 ± 0.03 | PI | Refaey and Chupka, 1968 | RDSH |
10.15 ± 0.05 | PI | Watanabe, 1957 | RDSH |
10.44 | PE | Benoit and Harrison, 1977 | Vertical value; LLK |
10.49 ± 0.03 | PE | Peel and Willett, 1975 | Vertical value; LLK |
10.42 | PE | Robin and Kuebler, 1973 | Vertical value; LLK |
10.36 | PE | Katsumata, Iwai, et al., 1973 | Vertical value; LLK |
10.42 | PE | Baker, Betteridge, et al., 1971 | Vertical value; LLK |
Appearance energy determinations
Ion | AE (eV) | Other Products | Method | Reference | Comment |
---|---|---|---|---|---|
CH3+ | 30.2 ± 0.2 | ? | EI | Olmsted, Street, et al., 1964 | RDSH |
CH3O+ | 12.5 | ? | EI | Friedman, Long, et al., 1957 | RDSH |
C2H3+ | 14.6 | ? | EI | Friedman, Long, et al., 1957 | RDSH |
C2H4O+ | 10.27 ± 0.09 | CH4 | EI | Bowen and Maccoll, 1984 | LBLHLM |
C2H4O+ | 10.26 | CH4 | EI | Holmes, Burgers, et al., 1982 | LBLHLM |
C2H4O+ | 10.23 ± 0.02 | CH4 | PI | Potapov and Sorokin, 1972 | LLK |
C2H4O+ | 10.27 ± 0.03 | CH4 | PI | Refaey and Chupka, 1968 | RDSH |
C2H5O+ | 10.20 ± 0.08 | CH3 | EI | Bowen and Maccoll, 1984 | LBLHLM |
C2H5O+ | 10.26 | CH3 | EI | Lossing, 1977 | LLK |
C2H5O+ | 10.40 ± 0.03 | CH3 | PI | Potapov and Sorokin, 1972 | LLK |
C2H5O+ | 10.70 | CH3 | EI | Haney and Franklin, 1969 | RDSH |
C2H5O+ | 10.40 | CH3 | PI | Refaey and Chupka, 1968 | RDSH |
C3H6+ | ~12.0 ± 0.9 | H2O | EI | Bowen and Maccoll, 1984 | LBLHLM |
C3H6+ | ~12.0 | H2O | PI | Refaey and Chupka, 1968 | RDSH |
C3H7+ | 11.6 | OH | PI | Refaey and Chupka, 1968 | RDSH |
C3H7O+ | ≤10.48 ± 0.08 | H | EI | Bowen and Maccoll, 1984 | LBLHLM |
C3H7O+ | ≤10.48 | H | EI | Lossing, 1977 | LLK |
C3H7O+ | 10.3 ± 0.5 | H | PI | Potapov and Sorokin, 1972 | LLK |
C3H7O+ | 10.6 | H | PI | Refaey and Chupka, 1968 | RDSH |
C3H7O+ | 11.85 | H | EI | Lambdin, Tuffly, et al., 1959 | RDSH |
De-protonation reactions
C3H7O- + =
By formula: C3H7O- + H+ = C3H8O
Quantity | Value | Units | Method | Reference | Comment |
---|---|---|---|---|---|
ΔrH° | 1569. ± 4.2 | kJ/mol | D-EA | Ramond, Davico, et al., 2000 | gas phase; B |
ΔrH° | 1571. ± 8.8 | kJ/mol | G+TS | Bartmess, Scott, et al., 1979 | gas phase; value altered from reference due to change in acidity scale; B |
ΔrH° | 1576. ± 4.2 | kJ/mol | CIDT | DeTuri and Ervin, 1999 | gas phase; B |
ΔrH° | 1572. ± 8.4 | kJ/mol | CIDC | Haas and Harrison, 1993 | gas phase; Both metastable and 50 eV collision energy.; B |
Quantity | Value | Units | Method | Reference | Comment |
ΔrG° | 1542. ± 4.6 | kJ/mol | H-TS | Ramond, Davico, et al., 2000 | gas phase; B |
ΔrG° | 1543. ± 8.4 | kJ/mol | IMRE | Bartmess, Scott, et al., 1979 | gas phase; value altered from reference due to change in acidity scale; B |
ΔrG° | 1544. ± 8.8 | kJ/mol | H-TS | Haas and Harrison, 1993 | gas phase; Both metastable and 50 eV collision energy.; B |

Ion clustering data

Data compiled as indicated in comments:
B - John E. Bartmess
M - Michael M. Meot-Ner (Mautner) and Sharon G. Lias
RCD - Robert C. Dunbar
Clustering reactions
+
= C3H8BrO-
By formula: Br- + C3H8O = C3H8BrO-
Quantity | Value | Units | Method | Reference | Comment |
---|---|---|---|---|---|
ΔrH° | 60.25 ± 0.84 | kJ/mol | TDAs | Bogdanov, Peschke, et al., 1999 | gas phase; B |
Quantity | Value | Units | Method | Reference | Comment |
ΔrG° | 34.9 | kJ/mol | TDAs | Bogdanov, Peschke, et al., 1999 | gas phase; B |
ΔrG° | 38. ± 8.4 | kJ/mol | IMRE | Tanabe, Morgon, et al., 1996 | gas phase; Anchored to H2O..Br- of Hiraoka, Mizure, et al., 19882; B |
+ 2
= C6H16BrO2-
By formula: Br- + 2C3H8O = C6H16BrO2-
Quantity | Value | Units | Method | Reference | Comment |
---|---|---|---|---|---|
ΔrH° | 51.46 ± 0.84 | kJ/mol | TDAs | Bogdanov, Peschke, et al., 1999 | gas phase; B |
Quantity | Value | Units | Method | Reference | Comment |
ΔrG° | 22.8 | kJ/mol | TDAs | Bogdanov, Peschke, et al., 1999 | gas phase; B |
By formula: CH3S- + C3H8O = (CH3S- • C3H8O)
Quantity | Value | Units | Method | Reference | Comment |
---|---|---|---|---|---|
ΔrH° | 71.55 ± 0.84 | kJ/mol | TDAs | Sieck and Meot-ner, 1989 | gas phase; B,M |
Quantity | Value | Units | Method | Reference | Comment |
ΔrS° | 96.7 | J/mol*K | PHPMS | Sieck and Meot-ner, 1989 | gas phase; M |
Quantity | Value | Units | Method | Reference | Comment |
ΔrG° | 42.7 ± 3.3 | kJ/mol | TDAs | Sieck and Meot-ner, 1989 | gas phase; B |
By formula: CN- + C3H8O = (CN- • C3H8O)
Quantity | Value | Units | Method | Reference | Comment |
---|---|---|---|---|---|
ΔrH° | 69.9 ± 3.3 | kJ/mol | TDAs | Larson, Szulejko, et al., 1988 | gas phase; B,M |
ΔrH° | 76. ± 15. | kJ/mol | IMRE | Larson and McMahon, 1987 | gas phase; B,M |
Quantity | Value | Units | Method | Reference | Comment |
ΔrS° | 110. | J/mol*K | PHPMS | Larson, Szulejko, et al., 1988 | gas phase; M |
ΔrS° | 104. | J/mol*K | N/A | Larson and McMahon, 1987 | gas phase; switching reaction,Thermochemical ladder(CN-)H2O, Entropy change calculated or estimated; Payzant, Yamdagni, et al., 1971; M |
Quantity | Value | Units | Method | Reference | Comment |
ΔrG° | 37.7 ± 0.84 | kJ/mol | TDAs | Larson, Szulejko, et al., 1988 | gas phase; B |
ΔrG° | 44.8 ± 9.6 | kJ/mol | IMRE | Larson and McMahon, 1987 | gas phase; B,M |
By formula: C2H7O+ + C3H8O = (C2H7O+ • C3H8O)
Bond type: Hydrogen bonds of the type OH-O between organics
Quantity | Value | Units | Method | Reference | Comment |
---|---|---|---|---|---|
ΔrH° | 133. | kJ/mol | ICR | Bomse and Beauchamp, 1981 | gas phase; switching reaction((CH3)2OH+)(CH3)2O, Entropy change calculated or estimated; Grimsrud and Kebarle, 1973, Lias, Liebman, et al., 1984; M |
Quantity | Value | Units | Method | Reference | Comment |
ΔrS° | 124. | J/mol*K | N/A | Bomse and Beauchamp, 1981 | gas phase; switching reaction((CH3)2OH+)(CH3)2O, Entropy change calculated or estimated; Grimsrud and Kebarle, 1973, Lias, Liebman, et al., 1984; M |
Quantity | Value | Units | Method | Reference | Comment |
ΔrG° | 96.7 | kJ/mol | ICR | Bomse and Beauchamp, 1981 | gas phase; switching reaction((CH3)2OH+)(CH3)2O, Entropy change calculated or estimated; Grimsrud and Kebarle, 1973, Lias, Liebman, et al., 1984; M |
By formula: C3H9O+ + C3H8O = (C3H9O+ • C3H8O)
Bond type: Hydrogen bonds of the type OH-O between organics
Quantity | Value | Units | Method | Reference | Comment |
---|---|---|---|---|---|
ΔrH° | 133. | kJ/mol | ICR | Bomse and Beauchamp, 1981 | gas phase; switching reaction((CH3)2OH+)(CH3)2O, Entropy change calculated or estimated; Grimsrud and Kebarle, 1973, Lias, Liebman, et al., 1984; M |
Quantity | Value | Units | Method | Reference | Comment |
ΔrS° | 124. | J/mol*K | N/A | Bomse and Beauchamp, 1981 | gas phase; switching reaction((CH3)2OH+)(CH3)2O, Entropy change calculated or estimated; Grimsrud and Kebarle, 1973, Lias, Liebman, et al., 1984; M |
Quantity | Value | Units | Method | Reference | Comment |
ΔrG° | 96.7 | kJ/mol | ICR | Bomse and Beauchamp, 1981 | gas phase; switching reaction((CH3)2OH+)(CH3)2O, Entropy change calculated or estimated; Grimsrud and Kebarle, 1973, Lias, Liebman, et al., 1984; M |
By formula: C3H9Si+ + C3H8O = (C3H9Si+ • C3H8O)
Quantity | Value | Units | Method | Reference | Comment |
---|---|---|---|---|---|
ΔrH° | 184. | kJ/mol | PHPMS | Wojtyniak and Stone, 1986 | gas phase; switching reaction,Thermochemical ladder((CH3)3Si+)H2O, Entropy change calculated or estimated; M |
Quantity | Value | Units | Method | Reference | Comment |
ΔrS° | 129. | J/mol*K | N/A | Wojtyniak and Stone, 1986 | gas phase; switching reaction,Thermochemical ladder((CH3)3Si+)H2O, Entropy change calculated or estimated; M |
Free energy of reaction
ΔrG° (kJ/mol) | T (K) | Method | Reference | Comment |
---|---|---|---|---|
123. | 468. | PHPMS | Wojtyniak and Stone, 1986 | gas phase; switching reaction,Thermochemical ladder((CH3)3Si+)H2O, Entropy change calculated or estimated; M |
By formula: C4H11O+ + C3H8O = (C4H11O+ • C3H8O)
Bond type: Hydrogen bonds of the type OH-O between organics
Quantity | Value | Units | Method | Reference | Comment |
---|---|---|---|---|---|
ΔrH° | 128. | kJ/mol | ICR | Bomse and Beauchamp, 1981 | gas phase; switching reaction((CH3)2OH+)(CH3)2O, Entropy change calculated or estimated; Grimsrud and Kebarle, 1973, Lias, Liebman, et al., 1984; M |
Quantity | Value | Units | Method | Reference | Comment |
ΔrS° | 118. | J/mol*K | N/A | Bomse and Beauchamp, 1981 | gas phase; switching reaction((CH3)2OH+)(CH3)2O, Entropy change calculated or estimated; Grimsrud and Kebarle, 1973, Lias, Liebman, et al., 1984; M |
Quantity | Value | Units | Method | Reference | Comment |
ΔrG° | 92.5 | kJ/mol | ICR | Bomse and Beauchamp, 1981 | gas phase; switching reaction((CH3)2OH+)(CH3)2O, Entropy change calculated or estimated; Grimsrud and Kebarle, 1973, Lias, Liebman, et al., 1984; M |
By formula: C4H11O+ + C3H8O = (C4H11O+ • C3H8O)
Bond type: Hydrogen bonds of the type OH-O between organics
Quantity | Value | Units | Method | Reference | Comment |
---|---|---|---|---|---|
ΔrH° | 134. | kJ/mol | ICR | Bomse and Beauchamp, 1981 | gas phase; switching reaction((CH3)2OH+)(CH3)2O, Entropy change calculated or estimated; Grimsrud and Kebarle, 1973, Lias, Liebman, et al., 1984; M |
Quantity | Value | Units | Method | Reference | Comment |
ΔrS° | 115. | J/mol*K | N/A | Bomse and Beauchamp, 1981 | gas phase; switching reaction((CH3)2OH+)(CH3)2O, Entropy change calculated or estimated; Grimsrud and Kebarle, 1973, Lias, Liebman, et al., 1984; M |
Quantity | Value | Units | Method | Reference | Comment |
ΔrG° | 99.6 | kJ/mol | ICR | Bomse and Beauchamp, 1981 | gas phase; switching reaction((CH3)2OH+)(CH3)2O, Entropy change calculated or estimated; Grimsrud and Kebarle, 1973, Lias, Liebman, et al., 1984; M |
+
= C9H13OS-
By formula: C6H5S- + C3H8O = C9H13OS-
Quantity | Value | Units | Method | Reference | Comment |
---|---|---|---|---|---|
ΔrH° | 62.76 ± 0.42 | kJ/mol | TDAs | Sieck and Meot-ner, 1989 | gas phase; B |
Quantity | Value | Units | Method | Reference | Comment |
ΔrG° | 30.5 ± 1.7 | kJ/mol | TDAs | Sieck and Meot-ner, 1989 | gas phase; B |
By formula: Cl- + C3H8O = (Cl- • C3H8O)
Quantity | Value | Units | Method | Reference | Comment |
---|---|---|---|---|---|
ΔrH° | 81.17 ± 0.84 | kJ/mol | TDAs | Bogdanov, Peschke, et al., 1999 | gas phase; B |
ΔrH° | 76.6 ± 4.2 | kJ/mol | TDAs | Hiraoka and Mizuse, 1987 | gas phase; B,M |
ΔrH° | 73.6 ± 8.4 | kJ/mol | IMRE | Larson and McMahon, 1984 | gas phase; B,M |
Quantity | Value | Units | Method | Reference | Comment |
ΔrS° | 103. | J/mol*K | PHPMS | Hiraoka and Mizuse, 1987 | gas phase; M |
ΔrS° | 97.1 | J/mol*K | N/A | Larson and McMahon, 1984 | gas phase; switching reaction(cl-)t-C4H9OH, Entropy change calculated or estimated; Larson and McMahon, 1984, 2; M |
Quantity | Value | Units | Method | Reference | Comment |
ΔrG° | 47.36 | kJ/mol | TDAs | Bogdanov, Peschke, et al., 1999 | gas phase; B |
ΔrG° | 45.61 | kJ/mol | TDAs | Hiraoka and Mizuse, 1987 | gas phase; B |
ΔrG° | 44.8 ± 8.4 | kJ/mol | IMRE | Larson and McMahon, 1984 | gas phase; B,M |
By formula: (Cl- • C3H8O) + C3H8O = (Cl- • 2C3H8O)
Quantity | Value | Units | Method | Reference | Comment |
---|---|---|---|---|---|
ΔrH° | 69.9 ± 1.3 | kJ/mol | TDAs | Bogdanov, Peschke, et al., 1999 | gas phase; B |
ΔrH° | 65.3 ± 4.2 | kJ/mol | TDAs | Hiraoka and Mizuse, 1987 | gas phase; B,M |
Quantity | Value | Units | Method | Reference | Comment |
ΔrS° | 105. | J/mol*K | PHPMS | Hiraoka and Mizuse, 1987 | gas phase; M |
Quantity | Value | Units | Method | Reference | Comment |
ΔrG° | 32.1 | kJ/mol | TDAs | Bogdanov, Peschke, et al., 1999 | gas phase; B |
ΔrG° | 34. ± 4.2 | kJ/mol | TDAs | Hiraoka and Mizuse, 1987 | gas phase; B |
By formula: (Cl- • 2C3H8O) + C3H8O = (Cl- • 3C3H8O)
Quantity | Value | Units | Method | Reference | Comment |
---|---|---|---|---|---|
ΔrH° | 62.3 ± 2.1 | kJ/mol | TDAs | Bogdanov, Peschke, et al., 1999 | gas phase; B |
ΔrH° | 52.3 ± 4.2 | kJ/mol | TDAs | Hiraoka and Mizuse, 1987 | gas phase; B,M |
Quantity | Value | Units | Method | Reference | Comment |
ΔrS° | 109. | J/mol*K | PHPMS | Hiraoka and Mizuse, 1987 | gas phase; M |
Quantity | Value | Units | Method | Reference | Comment |
ΔrG° | 22.2 | kJ/mol | TDAs | Bogdanov, Peschke, et al., 1999 | gas phase; B |
ΔrG° | 20. ± 4.2 | kJ/mol | TDAs | Hiraoka and Mizuse, 1987 | gas phase; B |
By formula: (Cl- • 3C3H8O) + C3H8O = (Cl- • 4C3H8O)
Quantity | Value | Units | Method | Reference | Comment |
---|---|---|---|---|---|
ΔrH° | 49.8 ± 4.2 | kJ/mol | TDAs | Hiraoka and Mizuse, 1987 | gas phase; B,M |
Quantity | Value | Units | Method | Reference | Comment |
ΔrS° | 120. | J/mol*K | PHPMS | Hiraoka and Mizuse, 1987 | gas phase; M |
Quantity | Value | Units | Method | Reference | Comment |
ΔrG° | 14. ± 4.2 | kJ/mol | TDAs | Hiraoka and Mizuse, 1987 | gas phase; B |
By formula: (Cl- • 4C3H8O) + C3H8O = (Cl- • 5C3H8O)
Quantity | Value | Units | Method | Reference | Comment |
---|---|---|---|---|---|
ΔrH° | 48.5 ± 4.2 | kJ/mol | TDAs | Hiraoka and Mizuse, 1987 | gas phase; B,M |
Quantity | Value | Units | Method | Reference | Comment |
ΔrS° | 128. | J/mol*K | PHPMS | Hiraoka and Mizuse, 1987 | gas phase; M |
Quantity | Value | Units | Method | Reference | Comment |
ΔrG° | 10. ± 4.2 | kJ/mol | TDAs | Hiraoka and Mizuse, 1987 | gas phase; B |
By formula: (Cl- • 5C3H8O) + C3H8O = (Cl- • 6C3H8O)
Quantity | Value | Units | Method | Reference | Comment |
---|---|---|---|---|---|
ΔrH° | 47.3 ± 4.2 | kJ/mol | TDAs | Hiraoka and Mizuse, 1987 | gas phase; B,M |
Quantity | Value | Units | Method | Reference | Comment |
ΔrS° | 130. | J/mol*K | PHPMS | Hiraoka and Mizuse, 1987 | gas phase; M |
Quantity | Value | Units | Method | Reference | Comment |
ΔrG° | 8.4 ± 4.2 | kJ/mol | TDAs | Hiraoka and Mizuse, 1987 | gas phase; B |
By formula: (Cl- • 6C3H8O) + C3H8O = (Cl- • 7C3H8O)
Quantity | Value | Units | Method | Reference | Comment |
---|---|---|---|---|---|
ΔrH° | 46.4 ± 4.2 | kJ/mol | TDAs | Hiraoka and Mizuse, 1987 | gas phase; B,M |
Quantity | Value | Units | Method | Reference | Comment |
ΔrS° | 131. | J/mol*K | PHPMS | Hiraoka and Mizuse, 1987 | gas phase; M |
Quantity | Value | Units | Method | Reference | Comment |
ΔrG° | 7.1 ± 4.2 | kJ/mol | TDAs | Hiraoka and Mizuse, 1987 | gas phase; B |
By formula: (Cl- • 7C3H8O) + C3H8O = (Cl- • 8C3H8O)
Quantity | Value | Units | Method | Reference | Comment |
---|---|---|---|---|---|
ΔrH° | 45.6 ± 4.2 | kJ/mol | TDAs | Hiraoka and Mizuse, 1987 | gas phase; Estimated entropy; single temperature measurement; B,M |
Quantity | Value | Units | Method | Reference | Comment |
ΔrS° | 130. | J/mol*K | N/A | Hiraoka and Mizuse, 1987 | gas phase; Entropy change calculated or estimated; M |
Quantity | Value | Units | Method | Reference | Comment |
ΔrG° | 6.7 ± 4.2 | kJ/mol | TDAs | Hiraoka and Mizuse, 1987 | gas phase; Estimated entropy; single temperature measurement; B |
+
= C3H7D8FO-
By formula: F- + C3H8O = C3H7D8FO-
Quantity | Value | Units | Method | Reference | Comment |
---|---|---|---|---|---|
ΔrG° | 102. ± 8.4 | kJ/mol | IMRE | Wilkinson, Szulejko, et al., 1992 | gas phase; Reported relative to ROH..F-, 0.5 kcal/mol weaker.; B |
By formula: F- + C3H8O = (F- • C3H8O)
Quantity | Value | Units | Method | Reference | Comment |
---|---|---|---|---|---|
ΔrH° | 140.2 ± 2.9 | kJ/mol | TDAs | Bogdanov, Peschke, et al., 1999 | gas phase; B |
ΔrH° | 135. ± 8.4 | kJ/mol | IMRE | Larson and McMahon, 1983 | gas phase; B,M |
ΔrH° | 139. ± 9.2 | kJ/mol | CIDT | DeTuri and Ervin, 1999 | gas phase; B |
Quantity | Value | Units | Method | Reference | Comment |
ΔrS° | 107. | J/mol*K | N/A | Larson and McMahon, 1983 | gas phase; switching reaction(F-)H2O, Entropy change calculated or estimated; Arshadi, Yamdagni, et al., 1970; M |
Quantity | Value | Units | Method | Reference | Comment |
ΔrG° | 107.5 | kJ/mol | TDAs | Bogdanov, Peschke, et al., 1999 | gas phase; B |
ΔrG° | 103. ± 8.4 | kJ/mol | IMRE | Larson and McMahon, 1983 | gas phase; B,M |
+ 2
= C6H16FO2-
By formula: F- + 2C3H8O = C6H16FO2-
Quantity | Value | Units | Method | Reference | Comment |
---|---|---|---|---|---|
ΔrH° | 87.03 ± 0.84 | kJ/mol | TDAs | Bogdanov, Peschke, et al., 1999 | gas phase; B |
Quantity | Value | Units | Method | Reference | Comment |
ΔrG° | 55.48 | kJ/mol | TDAs | Bogdanov, Peschke, et al., 1999 | gas phase; B |
+ 3
= C9H24FO3-
By formula: F- + 3C3H8O = C9H24FO3-
Quantity | Value | Units | Method | Reference | Comment |
---|---|---|---|---|---|
ΔrH° | 73.64 ± 0.84 | kJ/mol | TDAs | Bogdanov, Peschke, et al., 1999 | gas phase; B |
Quantity | Value | Units | Method | Reference | Comment |
ΔrG° | 35.0 | kJ/mol | TDAs | Bogdanov, Peschke, et al., 1999 | gas phase; B |
By formula: I- + C3H8O = (I- • C3H8O)
Quantity | Value | Units | Method | Reference | Comment |
---|---|---|---|---|---|
ΔrH° | 54.81 ± 0.84 | kJ/mol | TDAs | Bogdanov, Peschke, et al., 1999 | gas phase; B |
ΔrH° | 51.0 ± 4.2 | kJ/mol | TDAs | Caldwell and Kebarle, 1984 | gas phase; B,M |
Quantity | Value | Units | Method | Reference | Comment |
ΔrS° | 79.9 | J/mol*K | PHPMS | Caldwell and Kebarle, 1984 | gas phase; M |
Quantity | Value | Units | Method | Reference | Comment |
ΔrG° | 26.5 | kJ/mol | TDAs | Bogdanov, Peschke, et al., 1999 | gas phase; B |
ΔrG° | 27. ± 4.2 | kJ/mol | TDAs | Caldwell and Kebarle, 1984 | gas phase; B |
+ 2
= C6H16IO2-
By formula: I- + 2C3H8O = C6H16IO2-
Quantity | Value | Units | Method | Reference | Comment |
---|---|---|---|---|---|
ΔrH° | 46.0 ± 1.3 | kJ/mol | TDAs | Bogdanov, Peschke, et al., 1999 | gas phase; B |
Quantity | Value | Units | Method | Reference | Comment |
ΔrG° | 19.5 | kJ/mol | TDAs | Bogdanov, Peschke, et al., 1999 | gas phase; B |
+ 3
= C9H24IO3-
By formula: I- + 3C3H8O = C9H24IO3-
Quantity | Value | Units | Method | Reference | Comment |
---|---|---|---|---|---|
ΔrH° | 39.7 ± 2.9 | kJ/mol | TDAs | Bogdanov, Peschke, et al., 1999 | gas phase; B |
Quantity | Value | Units | Method | Reference | Comment |
ΔrG° | 14.8 | kJ/mol | TDAs | Bogdanov, Peschke, et al., 1999 | gas phase; B |
By formula: Li+ + C3H8O = (Li+ • C3H8O)
Quantity | Value | Units | Method | Reference | Comment |
---|---|---|---|---|---|
ΔrH° | 173. ± 7.9 | kJ/mol | CIDT | Rodgers and Armentrout, 2000 | RCD |
By formula: Mg+ + C3H8O = (Mg+ • C3H8O)
Quantity | Value | Units | Method | Reference | Comment |
---|---|---|---|---|---|
ΔrH° | 270. ± 20. | kJ/mol | ICR | Operti, Tews, et al., 1988 | gas phase; switching reaction,Thermochemical ladder(Mg+)CH3OH; M |
By formula: Na+ + C3H8O = (Na+ • C3H8O)
Quantity | Value | Units | Method | Reference | Comment |
---|---|---|---|---|---|
ΔrH° | 113. ± 4.2 | kJ/mol | CIDT | Armentrout and Rodgers, 2000 | RCD |
ΔrH° | 113. ± 4.6 | kJ/mol | CIDT | Rodgers and Armentrout, 1999 | RCD |
Free energy of reaction
ΔrG° (kJ/mol) | T (K) | Method | Reference | Comment |
---|---|---|---|---|
85.4 | 298. | IMRE | McMahon and Ohanessian, 2000 | Anchor alanine=39.89; RCD |
0.0 | 0. | CIDT | Rodgers and Armentrout, 1999 | RCD |

Henry's Law data

Data compiled by: Rolf Sander
Henry's Law constant (water solution)
kH(T) = k°H exp(d(ln(kH))/d(1/T) ((1/T) - 1/(298.15 K)))
k°H = Henry's law constant for solubility in water at 298.15 K (mol/(kg*bar))
d(ln(kH))/d(1/T) = Temperature dependence constant (K)
k°H (mol/(kg*bar)) | d(ln(kH))/d(1/T) (K) | Method | Reference | Comment |
---|---|---|---|---|
88. | Q | N/A | missing citation give several references for the Henry's law constants but don't assign them to specific species. | |
130. | 7500. | M | N/A | |
170. | R | N/A | ||
120. | M | Butler, Ramchandani, et al., 1935 |

Normal alkane RI, non-polar column, custom temperature program

Data compiled by: NIST Mass Spectrometry Data Center, William E. Wallace, director

Column type CapillaryCapillaryCapillaryCapillaryCapillary
Active phase HP-5Methyl SiliconeMethyl SiliconeMethyl SiliconeHP-5
Column length (m) 60.  60.60.
Carrier gas Helium  Helium
Substrate
Column diameter (mm) 0.25  0.320.32
Phase thickness (μm) 0.25  1.01.
Program 30 0C (2 min) 2 0Cmin -> 60 0C 10 0C/min -> 100 0C 20 0C/min -> 140 0C 10 0C/min -> 200 0C (10 min)not specifiednot specified-50 0C (2 min) 8 0C/min -> 200 0C (7.75 min) 25 0C -> 225 0C (8 min)not specified
I 516.477.477.498.499.
ReferenceRotsatschakul, Visesanguan, et al., 2009Chen and Feng, 2007Kou, Zhang, et al., 2006Blunden, Aneja, et al., 2005Thierry, Maillard, et al., 2005
Comment MSDC-RI MSDC-RI MSDC-RI MSDC-RI MSDC-RI
Column type CapillaryCapillaryCapillaryCapillaryCapillary
Active phase Methyl SiliconeSE-30Polydimethyl siloxaneMethyl SiliconePolydimethyl siloxanes
Column length (m)
Carrier gas
Substrate
Column diameter (mm)
Phase thickness (μm)
Program not specifiednot specifiednot specifiednot specifiednot specified
I 477.500.511.486.486.
ReferenceFu and Wang, 2004Vinogradov, 2004Spanier, Shahidi, et al., 2001Zenkevich, 1999Zenkevich, 1998
Comment MSDC-RI MSDC-RI MSDC-RI MSDC-RI MSDC-RI
Column type CapillaryCapillaryCapillaryCapillaryCapillary
Active phase SPB-1Methyl SiliconeSPB-1SPB-1DB-1
Column length (m) 60. 60.60.60.
Carrier gas He HeliumHelium
Substrate
Column diameter (mm) 0.53 0.530.530.32
Phase thickness (μm) 5. 5.05.0
Program 40C(6min) => 5C/min => 80C => 10C/min => 200Cnot specified40 0C (6 min) 5 0C/min -> 80 0C 10 0C/min -> 200 0Cnot specifiednot specified
I 474.486.474.530.475.
ReferenceFlanagan, Streete, et al., 1997Zenkevich, Korolenko, et al., 1995Strete, Ruprah, et al., 1992Strete, Ruprah, et al., 1992Binder, Flath, et al., 1989
Comment MSDC-RI MSDC-RI MSDC-RI MSDC-RI MSDC-RI
Column type CapillaryCapillaryCapillaryCapillaryCapillary
Active phase CP Sil 8 CBmethyl silicone oil with 5% Igepalmethyl silicone oil with 5% IgepalDB-1OV-101
Column length (m) 40.150.150.30.
Carrier gas He  H2
Substrate
Column diameter (mm) 0.250.750.750.25
Phase thickness (μm) 0.25  0.25
Program 30 0C (1 min) 15 0C/min -> 45 0C 3 0C/min -> 120 0Cnot specifiednot specified30C (2min) => 2C/min => 150C => 4C/min => 250Cnot specified
I 491.481.503.475.500.
ReferenceWeller and Wolf, 1989Schultz, Flath, et al., 1988Schultz, Flath, et al., 1988Takeoka, Flath, et al., 1988Shibamoto, 1987
Comment MSDC-RI MSDC-RI MSDC-RI MSDC-RI MSDC-RI

Kovats' RI, polar column, isothermal

Data compiled by: NIST Mass Spectrometry Data Center, William E. Wallace, director

Column type CapillaryCapillaryCapillaryCapillaryCapillary
Active phase Supelcowax-10OV-351OV-351OV-351OV-351
Column length (m) 60.25.25.25.25.
Carrier gas N2N2N2N2N2
Substrate
Column diameter (mm) 0.750.320.320.320.32
Phase thickness (μm)
Temperature (C) 60.60.80.60.80.
I 935.949.957.949.957.
ReferenceCastello, Vezzani, et al., 1991Haken and Korhonen, 1985Haken and Korhonen, 1985Haken, Madden, et al., 1985Haken, Madden, et al., 1985
Comment MSDC-RI MSDC-RI MSDC-RI MSDC-RI MSDC-RI
Column type PackedPackedPackedPackedPacked
Active phase Carbowax 20MCarbowax 20MPEG-2000PEG-2000PEG-2000
Column length (m) 2. 3.3.3.
Carrier gas N2 HeHeHe
Substrate Kieselgur (60-100 mesh)ChromosorbCelite 545 (44-60 mesh)Celite 545 (44-60 mesh)Celite 545 (44-60 mesh)
Column diameter (mm)
Phase thickness (μm)
Temperature (C) 75.100.150.152.179.
I 962.885.963.935.928.
ReferenceGoebel, 1982Kevei and Kozma, 1976Anderson, Jurel, et al., 1973Anderson, Jurel, et al., 1973Anderson, Jurel, et al., 1973
Comment MSDC-RI MSDC-RI MSDC-RI MSDC-RI MSDC-RI
Column type PackedPackedPackedPackedPacked
Active phase PEG-2000Carbowax 20MPolyethylene Glycol 4000Polyethylene Glycol 4000Polyethylene Glycol 4000
Column length (m) 3.2.6.6.6.
Carrier gas He
Substrate Celite 545 (44-60 mesh)Chromosorb WChromosorb PChromosorb PChromosorb P
Column diameter (mm)
Phase thickness (μm)
Temperature (C) 200.100.100.120.140.
I 922.912.932.920.910.
ReferenceAnderson, Jurel, et al., 1973Zarazir, Chovin, et al., 1970Bonastre and Grenier, 1968Bonastre and Grenier, 1968Bonastre and Grenier, 1968
Comment MSDC-RI MSDC-RI MSDC-RI MSDC-RI MSDC-RI
Column type PackedPacked
Active phase Polyethylene Glycol 4000Carbowax 20M
Column length (m) 6.2.
Carrier gas
Substrate Chromosorb P
Column diameter (mm)
Phase thickness (μm)
Temperature (C) 80.100.
I 940.903.
ReferenceBonastre and Grenier, 1968Rohrschneider, 1966
Comment MSDC-RI MSDC-RI

Van Den Dool and Kratz RI, non-polar column, custom temperature program

Data compiled by: NIST Mass Spectrometry Data Center, William E. Wallace, director

Column type CapillaryCapillaryPacked
Active phase HP-5MSHP-5SE-30
Column length (m) 30.30.3.05
Carrier gas HeHe
Substrate   Supelcoport; Chromosorb
Column diameter (mm) 0.250.25
Phase thickness (μm) 0.250.25
Program 5C(8min) => 3C/min => 20C => 10C/min => 150C(10min)5C(5min) => 3C/min => 20C => 5C/min => 100C 15C/min => 150C (5min)40C(5min) => 10C/min => 200C or 250C (60min)
I 510.510.483.
ReferenceBonaiti, Irlinger, et al., 2005Engel, Baty, et al., 2002Peng, Ding, et al., 1988
Comment MSDC-RI MSDC-RI MSDC-RI

Normal alkane RI, polar column, isothermal

Data compiled by: NIST Mass Spectrometry Data Center, William E. Wallace, director

Column type CapillaryCapillaryCapillaryCapillary
Active phase Carbowax 20MCarbowax 20MCarbowax 20MDB-Wax
Column length (m) 30.30.30.50.
Carrier gas HeliumHeliumHeliumHe
Substrate
Column diameter (mm) 0.250.250.250.32
Phase thickness (μm) 0.250.250.251.
Temperature (C) 100.60.80.60.
I 917.928.922.948.
ReferenceSun, Siepmann, et al., 2006Sun, Siepmann, et al., 2006Sun, Siepmann, et al., 2006Shimadzu, 2003
Comment MSDC-RI MSDC-RI MSDC-RI MSDC-RI

Normal alkane RI, polar column, custom temperature program

Data compiled by: NIST Mass Spectrometry Data Center, William E. Wallace, director

Column type CapillaryCapillaryCapillaryCapillaryCapillary
Active phase DB-WaxDB-WaxDB-WaxDB-WaxDB-Wax
Column length (m) 60.30.30.30.60.
Carrier gas HeliumHeliumHeliumHeliumHelium
Substrate
Column diameter (mm) 0.200.250.250.250.32
Phase thickness (μm) 0.250.250.250.251.0
Program 40 0C (3 min) 2 0C/min -> 150 0C 4 0C/min -> 220 0C (20 min) 5 0C/min -> 230 0Cnot specifiednot specifiednot specified40 0C (2 min) 4 0C/min -> 190 0C (11 min) 8 0C/min -> 220 0C (8 min)
I 921.912.925.938.947.
ReferenceGyawali and Kim, 2012Welke, Manfroi, et al., 2012Welke, Manfroi, et al., 2012Welke, Manfroi, et al., 2012Kadar, Juan-Borras, et al., 2010
Comment MSDC-RI MSDC-RI MSDC-RI MSDC-RI MSDC-RI
Column type CapillaryCapillaryCapillaryCapillaryCapillary
Active phase Supelcowax-10Supelcowax-10DB-WaxDB-WaxCarbowax 20M
Column length (m) 30.30.60.60.
Carrier gas HeHeHeHelium
Substrate
Column diameter (mm) 0.250.250.250.25
Phase thickness (μm) 0.250.250.250.25
Program 35C(8min) => 6C/min => 60C => 4C/min => 160C => 20C/min => 200C(1min)35C(8min) => 6C/min => 60C => 4C/min => 160C => 20C/min => 200C(1min)35C(5min) => 2C/min => 50C => 5C/min => 200C (5min)60 0C (3 min) 2 0C/min -> 150 0C 4 0C/min -> 200 0Cnot specified
I 970.975.910.933.884.
ReferenceBerard, Bianchi, et al., 2007Berard, Bianchi, et al., 2007Mattheis, Fan, et al., 2005Kim. J.H., Ahn, et al., 2004Vinogradov, 2004
Comment MSDC-RI MSDC-RI MSDC-RI MSDC-RI MSDC-RI
Column type CapillaryCapillaryCapillaryCapillaryCapillary
Active phase Polyethylene GlycolDB-WaxDB-WaxDB-WaxDB-Wax
Column length (m)  60.60. 60.
Carrier gas  HeHe
Substrate
Column diameter (mm)  0.250.25 0.32
Phase thickness (μm)  0.250.25
Program not specified35C (5min) => 2C/min => 50C => 5C/min => 200C(5min)35C (5min) => 2C/min => 50C => 5C/min => 200C(5min)not specifiednot specified
I 906.931.931.942.921.
ReferenceZenkevich, Korolenko, et al., 1995Mattheis, Buchanan, et al., 1992Mattheis, Buchanan, et al., 1992Peng, Yang, et al., 1991Binder, Flath, et al., 1989
Comment MSDC-RI MSDC-RI MSDC-RI MSDC-RI MSDC-RI
Column type CapillaryCapillaryCapillary
Active phase Carbowax 20MCarbowax 400, Carbowax 20M, Carbowax 1540, Carbowax 4000, Superox 06, PEG 20M, etc.Carbowax 20M
Column length (m)  50.
Carrier gas  Hydrogen
Substrate
Column diameter (mm)  0.32
Phase thickness (μm)
Program not specifiednot specifiednot specified
I 884.962.908.
ReferenceShibamoto, 1987Waggott and Davies, 1984Ramsey and Flanagan, 1982
Comment MSDC-RI MSDC-RI MSDC-RI

Kovats' RI, non-polar column, isothermal

Data compiled by: NIST Mass Spectrometry Data Center, William E. Wallace, director

Column type CapillaryCapillaryCapillaryCapillaryCapillary
Active phase SE-30SE-30SE-30SE-30SE-30
Column length (m)    25.25.
Carrier gas
Substrate
Column diameter (mm)    0.330.33
Phase thickness (μm)
Temperature (C) 100.60.80.100.60.
I 508.491.453.508.491.
ReferenceTarjan, Nyiredy, et al., 1989Tarjan, Nyiredy, et al., 1989Tarjan, Nyiredy, et al., 1989Haken and Korhonen, 1985Haken and Korhonen, 1985
Comment MSDC-RI MSDC-RI MSDC-RI MSDC-RI MSDC-RI
Column type CapillaryCapillaryCapillaryCapillaryPacked
Active phase SE-30SE-30SE-30SE-30SE-30
Column length (m) 25.25.25.25.2.
Carrier gas  N2N2N2
Substrate     Gaschrom Q
Column diameter (mm) 0.330.330.330.33
Phase thickness (μm)
Temperature (C) 80.100.60.80.100.
I 453.508.491.453.480.
ReferenceHaken and Korhonen, 1985Haken, Madden, et al., 1985Haken, Madden, et al., 1985Haken, Madden, et al., 1985Winskowski, 1983
Comment MSDC-RI MSDC-RI MSDC-RI MSDC-RI MSDC-RI
Column type PackedPackedPackedPackedPacked
Active phase Porapack QSE-30Apiezon LApiezon LApiezon L
Column length (m)  3.7
Carrier gas N2
Substrate  Celatom AW silanizedCelite 545Celite 545
Column diameter (mm)
Phase thickness (μm)
Temperature (C) 200.150.120.160.70.
I 458.447.450.444.450.
ReferenceGoebel, 1982Haken, Nguyen, et al., 1979Bogoslovsky, Anvaer, et al., 1978Bogoslovsky, Anvaer, et al., 1978Bogoslovsky, Anvaer, et al., 1978
Comment MSDC-RI MSDC-RI MSDC-RI MSDC-RI MSDC-RI
Column type PackedPackedPackedPackedPacked
Active phase ApolaneSE-30Apiezon MApiezon LSqualane
Column length (m) 2.41.2.13.
Carrier gas HeArN2CH4
Substrate ChromosorbChromosorb W AW DMCS HP (80-100 mesh)Chromosorb W Chromosorb G
Column diameter (mm)
Phase thickness (μm)
Temperature (C) 70.100.130.100.50.
I 446.0477.456.460.476.
ReferenceRiedo, Fritz, et al., 1976Pías and Gascó, 1975Golovnya and Garbuzov, 1974Wagaman and Smith, 1971Mira and Sanchez, 1970
Comment MSDC-RI MSDC-RI MSDC-RI MSDC-RI MSDC-RI
Column type PackedPackedPackedPacked
Active phase SE-30DC-200Apiezon LApiezon L
Column length (m) 2.4.5.
Carrier gas
Substrate Chromosorb W  Celite (40:60 Gewichtsverhaltnis)
Column diameter (mm)
Phase thickness (μm)
Temperature (C) 100.100.100.70.
I 490.486.463.450.
ReferenceZarazir, Chovin, et al., 1970Rohrschneider, 1966Rohrschneider, 1966von Kováts, 1958
Comment MSDC-RI MSDC-RI MSDC-RI MSDC-RI

Van Den Dool and Kratz RI, polar column, custom temperature program

Data compiled by: NIST Mass Spectrometry Data Center, William E. Wallace, director

Column type CapillaryCapillaryCapillaryCapillary
Active phase Supelcowax-10Supelcowax-10DB-WaxFFAP
Column length (m) 30.30.30.50.
Carrier gas HeHe He
Substrate
Column diameter (mm) 0.250.250.250.25
Phase thickness (μm) 0.250.250.250.25
Program 35C(8min) => 4C/min => 60C => 6C/min => 160C => 20C/min => 200C(1min)35C(8min) => 4C/min => 60C => 6C/min => 160C => 20C/min => 200C(1min)30C(8min) => 4C/min => 60C => 6C/min => 160C => 20C/min => 200C(1min)20C (5min) => 2C/min => 70C => 4C/min => 210C
I 975.970.935.924.
ReferenceBianchi, Careri, et al., 2007Bianchi, Careri, et al., 2007Radovic, Careri, et al., 2001Yasuhara, 1987
Comment MSDC-RI MSDC-RI MSDC-RI MSDC-RI

References

Buckley and Herington, 1965
Buckley, E.; Herington, E.F.G.,
Equilibria in some secondary alcohol + hydrogen + ketone systems,
Trans. Faraday Soc., 1965, 61, 1618-1625. [all data]
Chao and Rossini, 1965
Chao, J.; Rossini, F.D.,
Heats of combustion, formation, and isomerization of nineteen alkanols,
J. Chem. Eng. Data, 1965, 10, 374-379. [all data]
Snelson and Skinner, 1961
Snelson, A.; Skinner, H.A.,
Heats of combustion: sec-propanol, 1,4-dioxan, 1,3-dioxan and tetrahydropyran,
Trans. Faraday Soc., 1961, 57, 2125-2131. [all data]
Parks, Mosley, et al., 1950
Parks, G.S.; Mosley, J.R.; Peterson, P.V., Jr.,
Heats of combustion and formation of some organic compounds containing oxygen,
J. Chem. Phys., 1950, 18, 152. [all data]
Thermodynamics Research Center, 1997
Thermodynamics Research Center,
Selected Values of Properties of Chemical Compounds., Thermodynamics Research Center, Texas A&M University, College Station, Texas, 1997. [all data]
Green J.H.S., 1963
Green J.H.S.,
Thermodynamic properties of organic oxygen compounds. Part 12. Vibrational assignment and calculated thermodynamic properties 0-1000 K of isopropyl alcohol,
Trans. Faraday Soc., 1963, 59, 1559-1563. [all data]
Chao J., 1986
Chao J.,
Ideal gas thermodynamic properties of simple alkanols,
Int. J. Thermophys., 1986, 7, 431-442. [all data]
Chao J., 1986, 2
Chao J.,
Thermodynamic properties of key organic oxygen compounds in the carbon range C1 to C4. Part 2. Ideal gas properties,
J. Phys. Chem. Ref. Data, 1986, 15, 1369-1436. [all data]
Stromsoe E., 1970
Stromsoe E.,
Heat capacity of alcohol vapors at atmospheric pressure,
J. Chem. Eng. Data, 1970, 15, 286-290. [all data]
Parks G.S., 1940
Parks G.S.,
Some heat capacity data for isopropyl alcohol vapor,
J. Chem. Phys., 1940, 8, 429. [all data]
Hales J.L., 1963
Hales J.L.,
Thermodynamic properties of organic oxygen compounds. Part 10. Measurement of vapor heat capacities and latent heats of vaporization of isopropyl alcohol,
Trans. Faraday Soc., 1963, 59, 1544-1554. [all data]
Berman N.S., 1964
Berman N.S.,
Vapor heat capacity and heat of vaporization of 2-propanol,
J. Chem. Eng. Data, 1964, 9, 218-219. [all data]
Rossini, 1934
Rossini, F.D.,
Heats of combustion and of formation of the normal aliphatic alcohols in the gaseous and liquid states, and the energies of their atomic linkages,
J. Res. NBS, 1934, 13, 189-197. [all data]
Parks and Moore, 1939
Parks, G.S.; Moore, G.E.,
The heat of combustion of isopropanol,
J. Chem. Phys., 1939, 7, 1066-1067. [all data]
Andon, Counsell, et al., 1963
Andon, R.J.L.; Counsell, J.F.; Martin, J.F.,
Thermodynamic properties of organic oxygen compounds. Part II. The thermodynamic properties from 10 to 330 K of isopropyl alcohol,
Trans. Faraday Soc., 1963, 59, 1555-1558. [all data]
Kelley, 1929
Kelley, K.K.,
The heats capacities of isopropyl alcohol and acetone from 16 to 298 °K and the corresponding entropies and free energies,
J. Am. Chem. Soc., 1929, 51, 1145-1150. [all data]
Parks and Kelley, 1928
Parks, G.S.; Kelley, K.K.,
The application of the third law of thermodynamics to some organic reactions,
J. Phys. Chem., 1928, 32, 734-750. [all data]
Parks and Kelley, 1925
Parks, G.S.; Kelley, K.K.,
Thermal data on organic compounds. II. The heat capacities of five organic compounds. The entropies and free energies of some homologous series of aliphatic compounds,
J. Am. Chem. Soc., 1925, 47, 2089-2097. [all data]
Roux, Roberts, et al., 1980
Roux, G.; Roberts, D.; Perron, G.; Desnoyers, J.E.,
Microheterogeneity in aqueous-organic solutions: heat capacities, volumes and expansibilities of some alcohols, aminoalcohol and tertiary amines in water,
J. Solution Chem., 1980, 9(9), 629-647. [all data]
Brown and Ziegler, 1979
Brown, G.N., Jr.; Ziegler, W.T.,
Temperature dependence of excess thermodynamic properties of ethanol + n-heptane and 2-propanol + n-heptane solutions,
J. Chem. Eng. Data, 1979, 24, 319-330. [all data]
Griigo'ev, Yanin, et al., 1979
Griigo'ev, B.A.; Yanin, G.S.; Rastorguev, Yu.L.; Thermophysical parameters of alcohols, Tr. GIAP,
54, 1979, 57-64. [all data]
Katayama, 1962
Katayama, T.,
Heats of mixing, liquid heat capacities and enthalpy, concentration charts for methanol-water and isopropanol-water systems,
Kagaku Kogaku, 1962, 26, 361-372. [all data]
Swietoslawski and Zielenkiewicz, 1958
Swietoslawski, W.; Zielenkiewicz, A.,
Mean specific heats of binary positive azeotropes,
Bull. Acad. Pol. Sci. Ser. Sci. Chim., 1958, 6, 367-369. [all data]
Ginnings and Corruccini, 1948
Ginnings, D.C.; Corruccini, R.J.,
Liquid isopropyl alcohol. Enthalpy, entropy, and specific heat from 0° to 200°C,
Ind. Eng. Chem., 1948, 40, 1990-1991. [all data]
Zhdanov, 1945
Zhdanov, A.K.,
On the thermal capacity of some pure liquids and azeotropic mixtures,
Zhur. Obshch. Khim., 1945, 15, 895-902. [all data]
Phillip, 1939
Phillip, N.M.,
Adiabatic and isothermal compressibilities of liquids,
Proc. Indian Acad. Sci., 1939, A9, 109-120. [all data]
Trew and Watkins, 1933
Trew, V.C.G.; Watkins, G.M.C.,
Some physical properties of mixtures of certain organic liquids,
Trans. Faraday Soc., 1933, 29, 1310-1318. [all data]
Parks, Kelley, et al., 1929
Parks, G.S.; Kelley, K.K.; Huffman, H.M.,
Thermal data on organic compounds. V. A revision of the entropies and free energies of nineteen organic compounds,
J. Am. Chem. Soc., 1929, 51, 1969-1973. [all data]
Willams and Daniels, 1924
Willams, J.W.; Daniels, F.,
The specific heats of certain organic liquids at elevated temperatures,
J. Am. Chem. Soc., 1924, 46, 903-917. [all data]
Ogimachi, Corcoran, et al., 1961
Ogimachi, N.N.; Corcoran, J.M.; Kruse. H.W.,
Thermal Analysis of Systems of Hydrazine with Propyl Alcohol, Isopropyl Alcohol, and Allyl Alcohol,
J. Chem. Eng. Data, 1961, 6, 238. [all data]
Anonymous, 1958
Anonymous, X.,
Am. Pet. Inst. Res. Proj. 50, 1958, Unpublished, 1958. [all data]
Gude and Teja, 1995
Gude, M.; Teja, A.S.,
Vapor-Liquid Critical Properties of Elements and Compounds. 4. Aliphatic Alkanols,
J. Chem. Eng. Data, 1995, 40, 1025-1036. [all data]
Ambrose, Counsell, et al., 1978
Ambrose, D.; Counsell, J.F.; Lawrenson, I.J.; Lewis, G.B.,
Thermodynamic properties of organic oxygen compounds XLVII. Pressure, volume, temperature relations and thermodynamic properties of propan-2-ol,
J. Chem. Thermodyn., 1978, 10, 1033-1043. [all data]
Teja, Lee, et al., 1989
Teja, A.S.; Lee, R.J.; Rosenthal, D.J.; Anselme, M.J.,
Correlation of the Critical Properties of Alkanes and Alkanols
in 5th IUPAC Conference on Alkanes and AlkanolsGradisca, 1989. [all data]
Ambrose and Townsend, 1963
Ambrose, D.; Townsend, R.,
Thermodynamic Properties of Organic Oxygen Compounds IX. The Critical Properties and Vapor Pressures Above Five Atmospheres of Six Aliphatic Alcohols,
J. Chem. Soc., 1963, 54, 3614-25. [all data]
Majer and Svoboda, 1985
Majer, V.; Svoboda, V.,
Enthalpies of Vaporization of Organic Compounds: A Critical Review and Data Compilation, Blackwell Scientific Publications, Oxford, 1985, 300. [all data]
Segura, Galindo, et al., 2002
Segura, Hugo; Galindo, Graciela; Reich, Ricardo; Wisniak, Jaime; Loras, Sonia,
Isobaric Vapor-Liquid Equilibria and Densities for the System Methyl 1,1-Dimethylethyl Ether +2-Propanol,
Physics and Chemistry of Liquids, 2002, 40, 3, 277-294, https://doi.org/10.1080/0031910021000004865
. [all data]
Wormald and Vine, 2000
Wormald, C.J.; Vine, M.D.,
Specific enthalpy increments for propan-2-ol at temperatures up to 563.2 K and pressures up to 11.3 MPa,
The Journal of Chemical Thermodynamics, 2000, 32, 5, 659-669, https://doi.org/10.1006/jcht.1999.0631
. [all data]
Aucejo, Gonzalez-Alfaro, et al., 1995
Aucejo, Antonio; Gonzalez-Alfaro, Vicenta; Monton, Juan B.; Vazquez, M. Isabel,
Isobaric Vapor-Liquid Equilibria of Trichloroethylene with 1-Propanol and 2-Propanol at 20 and 100 kPa,
J. Chem. Eng. Data, 1995, 40, 1, 332-335, https://doi.org/10.1021/je00017a073
. [all data]
Stephenson and Malanowski, 1987
Stephenson, Richard M.; Malanowski, Stanislaw,
Handbook of the Thermodynamics of Organic Compounds, 1987, https://doi.org/10.1007/978-94-009-3173-2
. [all data]
Ambrose, Counsell, et al., 1970
Ambrose, D.; Counsell, J.F.; Davenport, A.J.,
The use of Chebyshev polynomials for the representation of vapour pressures between the triple point and the critical point,
The Journal of Chemical Thermodynamics, 1970, 2, 2, 283-294, https://doi.org/10.1016/0021-9614(70)90093-5
. [all data]
Wilhoit and Zwolinski, 1973
Wilhoit, R.C.; Zwolinski, B.J.,
Physical and thermodynamic properties of aliphatic alcohols,
J. Phys. Chem. Ref. Data Suppl., 1973, 1, 2, 1. [all data]
Van Ness, Soczek, et al., 1967
Van Ness, Hendrick C.; Soczek, C.A.; Peloquin, G.L.; Machado, R.L.,
Thermodynamic excess properties of three alcohol-hydrocarbon systems,
J. Chem. Eng. Data, 1967, 12, 2, 217-224, https://doi.org/10.1021/je60033a017
. [all data]
Berman, Larkam, et al., 1964
Berman, Neil S.; Larkam, Charles W.; McKetta, John J.,
Vapor Heat Capacity and Heat of Vaporization of 2-Propanol.,
J. Chem. Eng. Data, 1964, 9, 2, 218-219, https://doi.org/10.1021/je60021a020
. [all data]
Ambrose and Townsend, 1963, 2
Ambrose, D.; Townsend, R.,
681. Thermodynamic properties of organic oxygen compounds. Part IX. The critical properties and vapour pressures, above five atmospheres, of six aliphatic alcohols,
J. Chem. Soc., 1963, 3614, https://doi.org/10.1039/jr9630003614
. [all data]
Biddiscombe, Collerson, et al., 1963
Biddiscombe, D.P.; Collerson, R.R.; Handley, R.; Herington, E.F.G.; Martin, J.F.; Sprake, C.H.S.,
364. Thermodynamic properties of organic oxygen compounds. Part VIII. Purification and vapour pressures of the propyl and butyl alcohols,
J. Chem. Soc., 1963, 1954, https://doi.org/10.1039/jr9630001954
. [all data]
Hales, Cox, et al., 1963
Hales, J.L.; Cox, J.D.; Lees, E.B.,
Thermodynamic properties of organic oxygen compounds. Part 10.-Measurement of vapour heat capacities and latent heats of vaporization of isopropyl alcohol,
Trans. Faraday Soc., 1963, 59, 1544. [all data]
Williamson and Harrison, 1957
Williamson, K.D.; Harrison, R.H.,
Heats of vaporization of 1,1,2-trichloroethane, 1-propanol, and 2-propanol; vapor heat capacity of 1,1,2-trichloroethane,
J. Chem. Phys., 1957, 26, 1409-14. [all data]
Foz Gazulla, Morcilio, et al., 1955
Foz Gazulla, O.R.; Morcilio, J.; Perez-Masia, A.; Mendes, A.,
Anales Real Soc. Espan. Fis. Quim. (Madrid), 1955, 50B, 23. [all data]
Ambrose and Townsend, 1963, 3
Ambrose, D.; Townsend, R.,
Thermodynamic Properties of Organic Oxygen Compounds. Part 9. The Critical Properties and Vapour Pressures, above Five Atmospheres, of Six Aliphatic Alcohols,
J. Chem. Soc., 1963, 3614-3625, https://doi.org/10.1039/jr9630003614
. [all data]
Biddiscombe, Collerson, et al., 1963, 2
Biddiscombe, D.P.; Collerson, R.R.; Handley, R.; Herington, E.F.G.; Martin, J.F.; Sprake, C.H.S.,
Thermodynamic Properties of Organic Oxygen Compounds. Part 8. Purification and Vapor Pressures of the Propyl and Butyl Alcohols,
J. Chem. Soc., 1963, 1954-1957, https://doi.org/10.1039/jr9630001954
. [all data]
Domalski and Hearing, 1996
Domalski, Eugene S.; Hearing, Elizabeth D.,
Heat Capacities and Entropies of Organic Compounds in the Condensed Phase. Volume III,
J. Phys. Chem. Ref. Data, 1996, 25, 1, 1, https://doi.org/10.1063/1.555985
. [all data]
Ramond, Davico, et al., 2000
Ramond, T.M.; Davico, G.E.; Schwartz, R.L.; Lineberger, W.C.,
Vibronic structure of alkoxy radicals via photoelectron spectroscopy,
J. Chem. Phys., 2000, 112, 3, 1158-1169, https://doi.org/10.1063/1.480767
. [all data]
Bartmess, Scott, et al., 1979
Bartmess, J.E.; Scott, J.A.; McIver, R.T., Jr.,
The gas phase acidity scale from methanol to phenol,
J. Am. Chem. Soc., 1979, 101, 6047. [all data]
DeTuri and Ervin, 1999
DeTuri, V.F.; Ervin, K.M.,
Competitive threshold collision-induced dissociation: Gas-phase acidities and bond dissociation energies for a series of alcohols,
J. Phys. Chem. A, 1999, 103, 35, 6911-6920, https://doi.org/10.1021/jp991459m
. [all data]
Haas and Harrison, 1993
Haas, M.J.; Harrison, A.G.,
The Fragmentation of Proton-Bound Cluster Ions and the Gas-Phase Acidities of Alcohols,
Int. J. Mass Spectrom. Ion Proc., 1993, 124, 2, 115, https://doi.org/10.1016/0168-1176(93)80003-W
. [all data]
Bogdanov, Peschke, et al., 1999
Bogdanov, B.; Peschke, M.; Tonner, D.S.; Szulejko, J.E.; McMahon, T.B.,
Stepwise solvation of halides by alcohol molecules in the gas phase,
Int. J. Mass Spectrom., 1999, 187, 707-725, https://doi.org/10.1016/S1387-3806(98)14180-5
. [all data]
Hiraoka and Mizuse, 1987
Hiraoka, K.; Mizuse, S.,
Gas-Phase Solvation of Cl- with H2O, CH3OH, C2H4OH, i-C3H7OH, n-C3H7OH, and t-C4H9OH,
Chem. Phys., 1987, 118, 3, 457, https://doi.org/10.1016/0301-0104(87)85078-4
. [all data]
Larson and McMahon, 1984
Larson, J.W.; McMahon, T.B.,
Hydrogen bonding in gas phase anions. An experimental investigation of the interaction between chloride ion and bronsted acids from ICR chloride exchange equilibria,
J. Am. Chem. Soc., 1984, 106, 517. [all data]
Larson and McMahon, 1984, 2
Larson, J.W.; McMahon, T.B.,
Gas phase negative ion chemistry of alkylchloroformates,
Can. J. Chem., 1984, 62, 675. [all data]
Bomse and Beauchamp, 1981
Bomse, D.S.; Beauchamp, J.L.,
Slow Multiphoton Excitation as a Probe of Bimolecular and Unimolecular Reaction Energetics. Multiphoton Dissociation of Proton-Bound Alcohol Dimers,
J. Am. Chem. Soc., 1981, 103, 12, 3292, https://doi.org/10.1021/ja00402a011
. [all data]
Grimsrud and Kebarle, 1973
Grimsrud, E.P.; Kebarle, P.,
Gas Phase Ion Equilibria Studies of the Solvation of the Hydrogen Ion by Methanol, Dimethyl Ether and Water. Effect of Hydrogen Bonding,
J. Am. Chem. Soc., 1973, 95, 24, 7939, https://doi.org/10.1021/ja00805a002
. [all data]
Lias, Liebman, et al., 1984
Lias, S.G.; Liebman, J.F.; Levin, R.D.,
Evaluated gas phase basicities and proton affinities of molecules heats of formation of protonated molecules,
J. Phys. Chem. Ref. Data, 1984, 13, 695. [all data]
Larson, Szulejko, et al., 1988
Larson, J.W.; Szulejko, J.E.; McMahon, T.B.,
Gas Phase Lewis Acid-Base Interactions. An Experimental Determination of Cyanide Binding Energies From Ion Cyclotron Resonance and High-Pressure Mass Spectrometric Equilibrium Measurements.,
J. Am. Chem. Soc., 1988, 110, 23, 7604, https://doi.org/10.1021/ja00231a004
. [all data]
Larson and McMahon, 1987
Larson, J.W.; McMahon, T.B.,
Hydrogen bonding in gas phase anions. The energetics of interaction between cyanide ion and bronsted acids,
J. Am. Chem. Soc., 1987, 109, 6230. [all data]
Payzant, Yamdagni, et al., 1971
Payzant, J.D.; Yamdagni, R.; Kebarle, P.,
Hydration of CN-, NO2-, NO3-, and HO- in the gas phase,
Can. J. Chem., 1971, 49, 3308. [all data]
Larson and McMahon, 1983
Larson, J.W.; McMahon, T.B.,
Strong hydrogen bonding in gas-phase anions. An ion cyclotron resonance determination of fluoride binding energetics to bronsted acids from gas-phase fluoride exchange equilibria measurements,
J. Am. Chem. Soc., 1983, 105, 2944. [all data]
Arshadi, Yamdagni, et al., 1970
Arshadi, M.; Yamdagni, R.; Kebarle, P.,
Hydration of Halide Negative Ions in the Gas Phase. II. Comparison of Hydration Energies for the Alkali Positive and Halide Negative Ions,
J. Phys. Chem., 1970, 74, 7, 1475, https://doi.org/10.1021/j100702a014
. [all data]
Wojtyniak and Stone, 1986
Wojtyniak, A.C.M.; Stone, A.J.,
A High-Pressure Mass Spectrometric Study of the Bonding of Trimethylsilylium to Oxygen and Aromatic Bases,
Can. J. Chem., 1986, 74, 59. [all data]
Caldwell and Kebarle, 1984
Caldwell, G.; Kebarle, P.,
Binding energies and structural effects in halide anion-ROH and -RCOOH complexes from gas phase equilibria measurements,
J. Am. Chem. Soc., 1984, 106, 967. [all data]
Wiberg, Crocker, et al., 1991
Wiberg, K.B.; Crocker, L.S.; Morgan, K.M.,
Thermochemical studies of carbonyl compounds. 5. Enthalpies of reduction of carbonyl groups,
J. Am. Chem. Soc., 1991, 113, 3447-3450. [all data]
Dolliver, Gresham, et al., 1938
Dolliver, M.A.; Gresham, T.L.; Kistiakowsky, G.B.; Smith, E.A.; Vaughan, W.E.,
Heats of organic reactions. VI. Heats of hydrogenation of some oxygen-containing compounds,
J. Am. Chem. Soc., 1938, 60, 440-450. [all data]
Cox and Pilcher, 1970
Cox, J.D.; Pilcher, G.,
Thermochemistry of Organic and Organometallic Compounds, Academic Press, New York, 1970, 1-636. [all data]
Tanabe, Morgon, et al., 1996
Tanabe, F.K.J.; Morgon, N.H.; Riveros, J.M.,
Relative Bromide and Iodide Affinity of Simple Solvent Molecules Determined by FT-ICR,
J. Phys. Chem., 1996, 100, 8, 2862-2866, https://doi.org/10.1021/jp952290p
. [all data]
Hiraoka, Mizure, et al., 1988
Hiraoka, K.; Mizure, S.; Yamabe, S.; Nakatsuji, Y.,
Gas Phase Clustering Reactions of CN- and CH2CN- with MeCN,
Chem. Phys. Lett., 1988, 148, 6, 497, https://doi.org/10.1016/0009-2614(88)80320-8
. [all data]
Armentrout and Rodgers, 2000
Armentrout, P.B.; Rodgers, M.T.,
An Absolute Sodium Cation Affinity Scale: Threshold Collision-Induced Dissociation Experiments and ab Initio Theory,
J. Phys. Chem A, 2000, 104, 11, 2238, https://doi.org/10.1021/jp991716n
. [all data]
Rodgers and Armentrout, 1999
Rodgers, M.T.; Armentrout, P.B.,
Absolute Binding Energies of Sodium Ions to Short-Chain Alcohols, CnH2n+2O, n=1-4, Determined by Threshold Collision-Induced Dissociation Experiments and Ab Initio Theory, 1999, 4955. [all data]
McMahon and Ohanessian, 2000
McMahon, T.B.; Ohanessian, G.,
An Experimental and Ab Initio Study of the Nature of the Binding in Gas-Phase Complexes of Sodium Ions,
Chem. Eur. J., 2000, 6, 16, 2931, https://doi.org/10.1002/1521-3765(20000818)6:16<2931::AID-CHEM2931>3.0.CO;2-7
. [all data]
Sieck and Meot-ner, 1989
Sieck, L.W.; Meot-ner, M.,
Ionic Hydrogen Bond and Ion Solvation. 8. RS-..HOR Bond Strengths. Correlation with Acidities.,
J. Phys. Chem., 1989, 93, 4, 1586, https://doi.org/10.1021/j100341a079
. [all data]
Calderon, Tejero, et al., 1997
Calderon, A.; Tejero, J.; Izuierdo, J.F.; Iborra, M.; Cunill, F.,
Equilibrium Constants for the liquid-phase synthesis of isopropyl tert-butyl ether from 2-propanol and isobutene,
Ind. Eng. Chem. Res., 1997, 36, 896-902. [all data]
Sola, Pericas, et al., 1997
Sola, L.; Pericas, M.A.; Cunill, F.; Izquierdo, J.F.,
A comparative thermodynamic and kinetic study of the reaction between olefins and light alcohols leading to branced ethers. Reaction calorimetry study of the formation of tert-amyl methyl ether (TAME) and tert-butyl isopropyl ether (IPTBE),
Ind. Eng. Chem. Res., 1997, 36, 2012-2018. [all data]
Kolb and Burwell, 1945
Kolb, H.J.; Burwell, R.L., Jr.,
Equilibrium in the dehydrogenation of secondary propyl and butyl alcohols,
J. Am. Chem. Soc., 1945, 67, 1084-1088. [all data]
Wilkinson, Szulejko, et al., 1992
Wilkinson, F.E.; Szulejko, J.E.; Allison, C.E.; Mcmahon, T.B.,
Fourier Transform Ion Cyclotron Resonance Investigation of the Deuterium Isotope Effect on Gas Phase Ion/Molecule Hydrogen Bonding Interactions in Alcohol-Fluoride Adduct Ions,
Int. J. Mass Spectrom., 1992, 117, 487-505, https://doi.org/10.1016/0168-1176(92)80110-M
. [all data]
Operti, Tews, et al., 1988
Operti, L.; Tews, E.C.; Freiser, B.S.,
Determination of Gas-Phase Ligand Binding Energies to Mg+ by FTMS Techniques,
J. Am. Chem. Soc., 1988, 110, 12, 3847, https://doi.org/10.1021/ja00220a020
. [all data]
Wadso, 1958
Wadso, I.,
The heats of hydrolysis of some alkyl acetates,
Acta Chem. Scand., 1958, 12, 630-633. [all data]
Jensen and Pedersen, 1971
Jensen, R.B.; Pedersen, S.B.,
Reaction between chloral and alcohols. 9. Dissociation of chloral hemiacetals of some aliphatic primary and secondary alcohols,
Acta Chem. Scand., 1971, 25, 2911-2930. [all data]
Fedoseenko, Yursha, et al., 1983
Fedoseenko, V.I.; Yursha, I.A.; Kabo, G.Ya.,
Equilibrium and thermodynamics of cyclohexanol dehydrogenation reactions,
Dokl. Akad. Nauk BSSR, 1983, 27, 926-929. [all data]
Kennedy, Lacher, et al., 1969
Kennedy, M.B.; Lacher, J.R.; Park, J.D.,
Reaction heats of organic compounds. VI. Heats of addition of some alcohols to 1,1-dichloro-2,2-difluoroethylene,
Trans. Faraday Soc., 1969, 65, 1435-1442. [all data]
Kabo, Yursha, et al., 1988
Kabo, G.J.; Yursha, I.A.; Frenkel, M.L.; Poleshchuk, P.A.; Fedoseenko, V.I.; Ladutko, A.I.,
Thermodynamic properties of cyclohexanol and cyclohexanone,
J. Chem. Thermodyn., 1988, 20, 429-437. [all data]
Rubtsov, 1986
Rubtsov, Yu.I.,
Thermodynamic calculation of equilibrium in nitration of alcohols,
Bull. Acad. Sci. USSR, Div. Chem. Sci., 1986, 19-22. [all data]
Rice and Greenberg, 1934
Rice, F.O.; Greenberg, J.,
Ketene. III. Heat of formation and heat of reaction with alcohols,
J. Am. Chem. Soc., 1934, 38, 2268-2270. [all data]
Rodgers and Armentrout, 2000
Rodgers, M.T.; Armentrout, P.B.,
Noncovalent Metal-Ligand Bond Energies as Studied by Threshold Collision-Induced Dissociation,
Mass Spectrom. Rev., 2000, 19, 4, 215, https://doi.org/10.1002/1098-2787(200007)19:4<215::AID-MAS2>3.0.CO;2-X
. [all data]
Hunter and Lias, 1998
Hunter, E.P.; Lias, S.G.,
Evaluated Gas Phase Basicities and Proton Affinities of Molecules: An Update,
J. Phys. Chem. Ref. Data, 1998, 27, 3, 413-656, https://doi.org/10.1063/1.556018
. [all data]
Cao and Holmes, 2001
Cao, J.; Holmes, J.L.,
Determination of the proton affinities of secondary alcohols from the dissocation of proton-bound molecular trios,
European J. Mass Spectrom., 2001, 7, 243-247. [all data]
Bowen and Maccoll, 1984
Bowen, R.D.; Maccoll, A.,
Low energy, low temperature mass spectra,
Org. Mass Spectrom., 1984, 19, 379. [all data]
Potapov and Sorokin, 1972
Potapov, V.K.; Sorokin, V.V.,
Kinetic energies of products of dissociative photoionization of molecules. I. Aliphatic ketones and alcohols,
Khim. Vys. Energ., 1972, 6, 387. [all data]
Cocksey, Eland, et al., 1971
Cocksey, B.J.; Eland, J.H.D.; Danby, C.J.,
The effect of alkyl substitution on ionisation potential,
J. Chem. Soc., 1971, (B), 790. [all data]
Dewar and Worley, 1969
Dewar, M.J.S.; Worley, S.D.,
Photoelectron spectra of molecules. I. Ionization potentials of some organic molecules and their interpretation,
J. Chem. Phys., 1969, 50, 654. [all data]
Refaey and Chupka, 1968
Refaey, K.M.A.; Chupka, W.A.,
Photoionization of the lower aliphatic alcohols with mass analysis,
J. Chem. Phys., 1968, 48, 5205. [all data]
Watanabe, 1957
Watanabe, K.,
Ionization potentials of some molecules,
J. Chem. Phys., 1957, 26, 542. [all data]
Benoit and Harrison, 1977
Benoit, F.M.; Harrison, A.G.,
Predictive value of proton affinity. Ionization energy correlations involving oxygenated molecules,
J. Am. Chem. Soc., 1977, 99, 3980. [all data]
Peel and Willett, 1975
Peel, J.B.; Willett, G.D.,
Photoelectron spectroscopic studies of the higher alcohols,
Aust. J. Chem., 1975, 28, 2357. [all data]
Robin and Kuebler, 1973
Robin, M.B.; Kuebler, N.A.,
Excited electronic states of the simple alcohols,
J. Electron Spectrosc. Relat. Phenom., 1973, 1, 13. [all data]
Katsumata, Iwai, et al., 1973
Katsumata, S.; Iwai, T.; Kimura, K.,
Photoelectron spectra and sum rule consideration. Higher alkyl amines and alcohols,
Bull. Chem. Soc. Jpn., 1973, 46, 3391. [all data]
Baker, Betteridge, et al., 1971
Baker, A.D.; Betteridge, D.; Kemp, N.R.; Kirby, R.E.,
Application of photoelectron spectrometry to pesticide analysis. II.Photoelectron spectra of hydroxy-, and halo-alkanes and halohydrins,
Anal. Chem., 1971, 43, 375. [all data]
Olmsted, Street, et al., 1964
Olmsted, J., III; Street, K., Jr.; Newton, A.S.,
Excess-kinetic-energy ions in organic mass spectra,
J. Chem. Phys., 1964, 40, 2114. [all data]
Friedman, Long, et al., 1957
Friedman, L.; Long, F.A.; Wolfsberg, M.,
Study of the mass spectra of the lower aliphatic alcohols,
J. Chem. Phys., 1957, 27, 613. [all data]
Holmes, Burgers, et al., 1982
Holmes, J.L.; Burgers, P.C.; Mollah, Y.A.,
Alkane elimination from ionized alkanols,
Org. Mass Spectrom., 1982, 17, 127. [all data]
Lossing, 1977
Lossing, F.P.,
Heats of formation of some isomeric [CnH2n+1]+ ions. Substitutional effects on ion stability,
J. Am. Chem. Soc., 1977, 99, 7526. [all data]
Haney and Franklin, 1969
Haney, M.A.; Franklin, J.L.,
Excess energies in mass spectra of some oxygen-containing organic compounds,
J. Chem. Soc. Faraday Trans., 1969, 65, 1794. [all data]
Lambdin, Tuffly, et al., 1959
Lambdin, W.J.; Tuffly, B.L.; Yarborough, V.A.,
Appearance potentials as obtained with an analytical mass spectrometer,
Appl. Spectry., 1959, 13, 71. [all data]