Humulene
- Formula: C15H24
- Molecular weight: 204.3511
- IUPAC Standard InChIKey: FAMPSKZZVDUYOS-HRGUGZIWSA-N
- CAS Registry Number: 6753-98-6
- Chemical structure:
View 3d structure (requires JavaScript / HTML 5) - Other names: α-Caryophyllene; 1,4,8-Cycloundecatriene, 2,6,6,9-tetramethyl-, (E,E,E)-; α-Humulene; Cycloundeca-1,4,8-triene,2,6,6,9-tetramethyl-, (E,E,E)-; 2,6,6,9-Tetramethyl-1,4,8-cycloundecatriene-, (1E,4E,8E)-; α-Humulenen; α-Humulene (α-caryophyllene); α-Humullene; (E)-α-Caryophyllene; α-Humulen

Phase change data

Data compiled by: Robert L. Brown and Stephen E. Stein
Reduced pressure boiling point
Tboil (K) | Pressure (bar) | Reference |
---|---|---|
396.2 | 0.013 | Weast and Grasselli, 1989 |

Gas phase ion energetics data

Data compiled by: Sharon G. Lias, Rhoda D. Levin, and Sherif A. Kafafi
Ionization energy determinations
IE (eV) | Method | Reference | Comment |
---|---|---|---|
9.54 | PE | Martin, Heller, et al., 1980 | Vertical value |

Van Den Dool and Kratz RI, non-polar column, custom temperature program

Data compiled by: NIST Mass Spectrometry Data Center, William E. Wallace, director

Column type CapillaryCapillaryCapillaryCapillaryCapillary
Active phase DB-5BPX-5BP-5CBP-5VF-5MS
Column length (m) 30.30.25.30.30.
Carrier gas HeHeHeHeHe
Substrate
Column diameter (mm) 0.250.250.220.250.25
Phase thickness (μm) 0.250.250.250.250.25
Program 40C(2min) => 4C/min => 220C => 20C/min => 280C35C => 4C/min => 200C => 30C/min => 300C (3min)30C(1min) => 50C/min => 105C => 1.5C/min => 150C => 30C/min => 280C (10min)60C => 3C/min => 246C => 10C/min => 270C (5min)40C(2min) => 5C/min => 200C (2min) => 30C/min => 260C
I 1457.1467.1458.1454.1449.
ReferenceAndrade, Sampaio, et al., 2007Dharmawan, Kasapis, et al., 2007Sant'Anna, Fontes, et al., 2007Silva, Oliveira, et al., 2007Carasek and Pawliszyn, 2006
Comment MSDC-RI MSDC-RI MSDC-RI MSDC-RI MSDC-RI
Column type CapillaryCapillaryCapillaryCapillaryCapillary
Active phase VF-5MSVF-5MSBPX-5SE-52DB-5
Column length (m) 30.30.30.30.30.
Carrier gas HeHe HeHe
Substrate
Column diameter (mm) 0.250.250.250.320.32
Phase thickness (μm) 0.250.250.250.150.25
Program 40C(2min) => 5C/min => 200C (2min) => 30C/min => 260C40C(2min) => 5C/min => 200C (2min) => 30C/min => 260C35C(5min) => 3C/min => 210C => 40C/min => 240C (4min)45C => 1C/min => 100C => 5C/min => 250C (10min)40C(3min) => 3C/min => 180C => 10C/min => 260C(2min)
I 1449.1449.1469.1437.1443.
ReferenceCarasek and Pawliszyn, 2006Carasek and Pawliszyn, 2006Cardeal, da Silva, et al., 2006Guerrini, Sacchetti, et al., 2006Moon, Cliff, et al., 2006
Comment MSDC-RI MSDC-RI MSDC-RI MSDC-RI MSDC-RI
Column type CapillaryCapillaryCapillaryCapillaryCapillary
Active phase DB-1SE-52SE-52CBP-55 % Phenyl methyl siloxane
Column length (m) 30.30.25.30.30.
Carrier gas HeHeH2HeHe
Substrate
Column diameter (mm) 0.250.320.320.250.32
Phase thickness (μm) 0.250.150.430.250.15
Program 35C => 2C/min => 200C => 5C/min => 240C45C => 1C/min => 100C => 5C/min => 250C(10min)60C(8min) => 3C/min => 180C => 20C/min => 250C(10min)60C => 3C/min => 240C => 10C/min => 280C(10min)45C => 1C/min => 100C => 5C/min => 250C (10min)
I 1428.1456.1448.1452.1455.
ReferenceSuliman F.E.O., Fatope M.O., et al., 2006Bruni, Pellati, et al., 2005Lorenzo, Paz, et al., 2005Oliveira, Campos, et al., 2005Sacchetti, Maietti, et al., 2005
Comment MSDC-RI MSDC-RI MSDC-RI MSDC-RI MSDC-RI
Column type CapillaryCapillaryCapillaryCapillaryCapillary
Active phase DB-5MSSPB-1SE-52CP-Sil5 CB MSDB-1
Column length (m) 30.50.25.60.30.
Carrier gas He H2HeHe
Substrate
Column diameter (mm) 0.250.250.320.320.32
Phase thickness (μm) 0.250.250.430.250.1
Program 40 (5min) => 4C/min => 140C => 4C/min => 200C (20min)70C(3min) => 4C/min => 120C => 8C/min => 250C60C(8min) => 3C/min => 180C => 20C/min => 250C(10min)40C(1min) => 25C/min => 120C => 2C/min => 190C => 25C/min => 250C (5min)40C(5min) => 20C/min => 100C => 2C/min => 160C => 40C/min => 250C (5min)
I 1450.1461.1445.1448.01421.8
ReferenceZheng, Kim, et al., 2005Díaz-Maroto, Sánchez Palomo, et al., 2004Frizzo, Lorenzo, et al., 2004Helmig, Bocquet, et al., 2004Helmig, Bocquet, et al., 2004
Comment MSDC-RI MSDC-RI MSDC-RI MSDC-RI MSDC-RI
Column type CapillaryCapillaryCapillaryCapillaryCapillary
Active phase DB-1SE-52SE-52SE-52CP Sil 8 CB
Column length (m) 30.25.30.25.50.
Carrier gas He HeHeHe
Substrate
Column diameter (mm) 0.320.320.520.250.32
Phase thickness (μm) 0.250.40.150.25
Program 40C(5min) => 20C/min => 100C => 2C/min => 160C => 40C/min => 250C (5min)60C(8min) => 3C/min => 180C => 20C/min => 250C(10min)45C => 1C/min => 100C => 5C/min => 250C (10min)60C(8min) => 3C/min => 180C => 20C/min => 230C60C (2min) => 5C/min => 160C (1min) => 10C/min => 250C (2min)
I 1433.11449.1456.1449.1454.
ReferenceHelmig, Bocquet, et al., 2004Lorenzo, Paz, et al., 2004Sacchetti, Medici, et al., 2004Lorenzo, Loayza, et al., 2003Mockute and Judzentiene, 2003
Comment MSDC-RI MSDC-RI MSDC-RI MSDC-RI MSDC-RI
Column type CapillaryCapillaryCapillaryCapillaryCapillary
Active phase CBP-5SE-52BP-1SE-52SE-52
Column length (m) 50.30.50.25.30.
Carrier gas HeH2 H2H2
Substrate
Column diameter (mm) 0.250.320.220.320.32
Phase thickness (μm) 0.250.420.250.400.40
Program 60C(2min) => 3C/min => 240C => 10C/min => 280C(10min)60C(8min) => 3C/min => 180C => 20C/min => 250C(10min)not specified60 0C (8 min) 3 K/min -> 180 0C 20 K/min -> 250 0C (10 min)60 0C (8 min) 3 K/min -> 180 0C 20 K/min -> 250 0C (10 min)
I 1452.1445.1453.1448.1449.
ReferenceAzevedo, Campos, et al., 2002Lorenzo, Paz, et al., 2002Cavalli, Ranarivelo, et al., 2001Lorenzo, Dellacassa, et al., 2001Lorenzo, Paz, et al., 2001
Comment MSDC-RI MSDC-RI MSDC-RI MSDC-RI MSDC-RI
Column type CapillaryCapillaryCapillaryCapillaryCapillary
Active phase SE-52DB-1HP-5SE-52CP Sil 8 CB
Column length (m) 25.60.30.25.30.
Carrier gas HeHe HeHe
Substrate
Column diameter (mm) 0.250.250.250.250.32
Phase thickness (μm) 0.250.250.250.25
Program 60 0C (8 min) 3 K/min -> 180 0C 20 K/min -> 230 0C-20C (5min) => 10C/min => 100C => 4C/min => 200C => 10C/min => 280C40C(1min) => 3C/min => 120C => 5C/min => 280C60C(8min) => 3C/min => 180C => 20C/min => 230C35C (2min) => 40C/min => 50C (2min) => 6C/min => 180C => 10C/min => 240C
I 1456.1463.1452.1446.1457.
ReferenceLorenzo, Saavedra, et al., 2001Eri, Khoo, et al., 2000Isidorov, Krajewska, et al., 2000Lorenzo, Dellacassa, et al., 2000Steinhaus and Schieberle, 2000
Comment MSDC-RI MSDC-RI MSDC-RI MSDC-RI MSDC-RI
Column type CapillaryCapillary
Active phase CP Sil 5 CBSE-52
Column length (m)  60.
Carrier gas  He
Substrate
Column diameter (mm)  0.32
Phase thickness (μm)  0.40
Program not specified45 C (6 min) 3 C/min -> 111 0C 2 C/min -> 160 C 3 C/min -> 300 C (15 min)
I 1437.1462.
ReferenceChanegriha, Baaliouamer, et al., 1998Mondello, Dugo, et al., 1995
Comment MSDC-RI MSDC-RI

References

Weast and Grasselli, 1989
CRC Handbook of Data on Organic Compounds, 2nd Editon, Weast,R.C and Grasselli, J.G., ed(s)., CRC Press, Inc., Boca Raton, FL, 1989, 1. [all data]
Martin, Heller, et al., 1980
Martin, H.-D.; Heller, C.; Mayer, B.; Beckhaus, H.-D.,
Synthese bicyclischer, nicht-konjugierter Polyene. Stereochemie und transanulare Wechselwirkungen,
Chem. Ber., 1980, 113, 2589. [all data]