2H-Pyran-2-one, 4,6-dimethyl-
- Formula: C7H8O2
- Molecular weight: 124.1372
- IUPAC Standard InChIKey: IXYLIUKQQQXXON-UHFFFAOYSA-N
- CAS Registry Number: 675-09-2
- Chemical structure:
View 3d structure (requires JavaScript / HTML 5) - Other names: Sorbic acid, 5-hydroxy-3-methyl-, δ-lactone; Mesitene lactone; 2,4-Dimethyl-α-pyrone; 4,6-Dimethyl-α-pyrone; 4,6-Dimethyl-2-pyrone; 4,6-Dimethylcoumalin; 4,6-Dimethyl-2H-pyran-2-one

Gas phase ion energetics data

Data compiled as indicated in comments:
LBLHLM - Sharon G. Lias, John E. Bartmess, Joel F. Liebman, John L. Holmes, Rhoda D. Levin, and W. Gary Mallard
Ionization energy determinations
IE (eV) | Method | Reference | Comment |
---|---|---|---|
8.51 | EI | Grutzmacher and Spilker, 1985 | LBLHLM |
Appearance energy determinations
Ion | AE (eV) | Other Products | Method | Reference | Comment |
---|---|---|---|---|---|
C6H8O+ | 9.85 | CO | EI | Grutzmacher and Spilker, 1985 | LBLHLM |

References

Grutzmacher and Spilker, 1985
Grutzmacher, H.-F.; Spilker, R.,
Loss of CO from 4,6-dimethyl-2-pyrone and 2,6-dimethyl-4-pyrone radical cations,
Org. Mass Spectrom., 1985, 20, 258. [all data]