Thorium dichlorobis[(1,2,3,4,5-η5)-1,2,3,4,5-pentamethyl-2,4-cyclopentadien-1-yl]-
- Formula: C20H30Cl2Th
- Molecular weight: 573.396
- CAS Registry Number: 67506-88-1

Gas phase ion energetics data

Data compiled by: Sharon G. Lias, Rhoda D. Levin, and Sherif A. Kafafi
Ionization energy determinations
IE (eV) | Method | Reference | Comment |
---|---|---|---|
7.1 | PE | Ciliberto, Condorelli, et al., 1981 | |
7.43 | PE | Ciliberto, Condorelli, et al., 1981 | Vertical value |

References

Ciliberto, Condorelli, et al., 1981
Ciliberto, E.; Condorelli, G.; Fagan, P.J.; Manriquez, J.M.; Fragala, I.; Marks, T.J.,
Photoelectron spectroscopy of f-element organometallic complexes. 4. Comparative studies of bis(pentamethylcyclopentadienyl)dichloride and dimethyl complexes of uranium(IV), thorium(IV), and zirconium(IV),
J. Am. Chem. Soc., 1981, 103, 4755. [all data]