4a(2H)-Naphthalenol,1,3,4,7,8,8a-hexahydro-8a-methyl-trans-

Gas phase ion energetics data

Data compiled by: Sharon G. Lias, Rhoda D. Levin, and Sherif A. Kafafi

Ionization energy determinations

IE (eV) Method Reference Comment
9.35 ± 0.02PEBrown, Marcinko, et al., 1979Vertical value
9.35 ± 0.05PEBrown and Marcinko, 1978Vertical value

References

Brown, Marcinko, et al., 1979
Brown, R.S.; Marcinko, R.W.; Tse, A., Application of photoelectron spectroscopy to substituent effects. Conformational analysis of some flexible allylic ethers and alcohols, Can. J. Chem., 1979, 57, 1890. [all data]

Brown and Marcinko, 1978
Brown, R.S.; Marcinko, R.W., Influence of substituents upon ionization potential. Dependence of the π-ionization energy on the orientation of an allylic hydroxyl or methoxyl substituent, J. Am. Chem. Soc., 1978, 100, 5721. [all data]