4-Methylspiro[2.4]hepta-4,6-diene
- Formula: C8H10
- Molecular weight: 106.1650
- IUPAC Standard InChIKey: TYRKZHXFLRLILE-UHFFFAOYSA-N
- CAS Registry Number: 67487-86-9
- Chemical structure:
View 3d structure (requires JavaScript / HTML 5) - Permanent link for this species. Use this link for bookmarking this species for future reference.

Gas phase ion energetics data

Data compiled by: Henry M. Rosenstock, Keith Draxl, Bruce W. Steiner, and John T. Herron
Ionization energy determinations
IE (eV) | Method | Reference |
---|---|---|
8.0 ± 0.1 | EI | Meyer, Haynes, et al., 1965 |
Appearance energy determinations
Ion | AE (eV) | Other Products | Method | Reference | Comment |
---|---|---|---|---|---|
C7H7+ | 9.8 ± 0.1 | CH3 | EI | Meyer, Haynes, et al., 1965 | |
C8H9+ | 9.9 ± 0.1 | H | EI | Meyer, Haynes, et al., 1965 |

References

Meyer, Haynes, et al., 1965
Meyer, F.; Haynes, P.; McLean, S.; Harrison, A.G.,
An electron impact study of some C8H10 isomers,
Can. J. Chem., 1965, 43, 211. [all data]