2-Oxetanone, 4-methylene-
- Formula: C4H4O2
- Molecular weight: 84.0734
- IUPAC Standard InChIKey: WASQWSOJHCZDFK-UHFFFAOYSA-N
- CAS Registry Number: 674-82-8
- Chemical structure:
View 3d structure (requires JavaScript / HTML 5) - Other names: Diketene; Ethenone, dimer; Ketene dimer; 3-Butenoic acid, 3-hydroxy-, β-lactone; 4-Methylene-2-oxetanone; Diketen; Vinylaceto-β-lactone; but-3-en-3-olide

Gas phase thermochemistry data

Data compiled as indicated in comments:
ALS - Hussein Y. Afeefy, Joel F. Liebman, and Stephen E. Stein
GT - Glushko Thermocenter, Russian Academy of Sciences, Moscow
Quantity | Value | Units | Method | Reference | Comment |
---|---|---|---|---|---|
ΔfH°gas | -190.2 ± 0.54 | kJ/mol | Ccr | Mansson, Nakase, et al., 1968 | ALS |
Constant pressure heat capacity of gas
Cp,gas (J/mol*K) | Temperature (K) | Reference | Comment |
---|---|---|---|
36.27 | 50. | Thermodynamics Research Center, 1997 | p=1 bar. Selected entropy and heat capacity at 298.15 K are in close agreement with statistical values calculated by [ Joshi R.M., 1970]. However entropy values at 600 and 1000 K obtained by [ Joshi R.M., 1970] are about 27 J/mol*K lower than selected ones. Estimations by difference method [ Dorofeeva O.V., 1997] give preference for data [ Thermodynamics Research Center, 1997].; GT |
42.49 | 100. | ||
50.94 | 150. | ||
61.35 | 200. | ||
78.44 | 273.15 | ||
84.41 | 298.15 | ||
84.84 | 300. | ||
107.35 | 400. | ||
126.33 | 500. | ||
141.71 | 600. | ||
154.21 | 700. | ||
164.49 | 800. | ||
173.06 | 900. | ||
180.27 | 1000. | ||
186.4 | 1100. | ||
191.6 | 1200. | ||
196.0 | 1300. | ||
199.9 | 1400. | ||
203.2 | 1500. |

Condensed phase thermochemistry data

Data compiled by: Hussein Y. Afeefy, Joel F. Liebman, and Stephen E. Stein
Quantity | Value | Units | Method | Reference | Comment |
---|---|---|---|---|---|
ΔfH°liquid | -233.1 ± 0.46 | kJ/mol | Ccr | Mansson, Nakase, et al., 1968 | |
Quantity | Value | Units | Method | Reference | Comment |
ΔcH°liquid | -1912.5 ± 0.42 | kJ/mol | Ccr | Mansson, Nakase, et al., 1968 | Corresponding ΔfHºliquid = -233.1 kJ/mol (simple calculation by NIST; no Washburn corrections) |

Phase change data

Data compiled as indicated in comments:
BS - Robert L. Brown and Stephen E. Stein
ALS - Hussein Y. Afeefy, Joel F. Liebman, and Stephen E. Stein
DRB - Donald R. Burgess, Jr.
AC - William E. Acree, Jr., James S. Chickos
Quantity | Value | Units | Method | Reference | Comment |
---|---|---|---|---|---|
Tboil | 400.6 | K | N/A | Weast and Grasselli, 1989 | BS |
Tboil | 399.2 | K | N/A | Majer and Svoboda, 1985 | |
Quantity | Value | Units | Method | Reference | Comment |
ΔvapH° | 42.9 | kJ/mol | N/A | Majer and Svoboda, 1985 | |
ΔvapH° | 42.9 ± 0.1 | kJ/mol | C | Mansson, Nakase, et al., 1968 | ALS |
ΔvapH° | 42.9 | kJ/mol | N/A | Mansson, Nakase, et al., 1968 | DRB |
ΔvapH° | 42.9 ± 0.1 | kJ/mol | C | Mansson, Nakase, et al., 1968 | AC |
Reduced pressure boiling point
Tboil (K) | Pressure (bar) | Reference | Comment |
---|---|---|---|
342.7 | 0.133 | Aldrich Chemical Company Inc., 1990 | BS |
Enthalpy of vaporization
ΔvapH (kJ/mol) | Temperature (K) | Method | Reference | Comment |
---|---|---|---|---|
36.8 | 399.2 | N/A | Majer and Svoboda, 1985 | |
42.9 | 312. | A | Stephenson and Malanowski, 1987 | Based on data from 297. to 388. K.; AC |

Reaction thermochemistry data

Data compiled by: Hussein Y. Afeefy, Joel F. Liebman, and Stephen E. Stein
Individual Reactions
By formula: C4H4O2 + H3N = acetoacetamide
Quantity | Value | Units | Method | Reference | Comment |
---|---|---|---|---|---|
ΔrH° | -173.0 | kJ/mol | Kin | Lopatin, Popov, et al., 1992 | liquid phase; solvent: Solution |
By formula: C4H4O2 + H2O = C4H6O3
Quantity | Value | Units | Method | Reference | Comment |
---|---|---|---|---|---|
ΔrH° | -118.5 | kJ/mol | Kin | Lopatin, Popov, et al., 1992 | liquid phase; solvent: Solution |
By formula: C2H6O + C4H4O2 = C6H10O3
Quantity | Value | Units | Method | Reference | Comment |
---|---|---|---|---|---|
ΔrH° | -127.0 | kJ/mol | Kin | Lopatin, Popov, et al., 1992 | liquid phase; solvent: Solution |
By formula: CH4N2O + C4H4O2 = N-(aminocarbonyl)-3-oxobutyramide
Quantity | Value | Units | Method | Reference | Comment |
---|---|---|---|---|---|
ΔrH° | -106.4 | kJ/mol | Kin | Lopatin, Popov, et al., 1992 | liquid phase; solvent: Solution |
By formula: 2C4H4O2 = C8H8O4
Quantity | Value | Units | Method | Reference | Comment |
---|---|---|---|---|---|
ΔrH° | -91.9 | kJ/mol | Kin | Lopatin, Popov, et al., 1992 | liquid phase; solvent: Solution |

Gas phase ion energetics data

Data compiled by: Sharon G. Lias, John E. Bartmess, Joel F. Liebman, John L. Holmes, Rhoda D. Levin, and W. Gary Mallard
Ionization energy determinations
IE (eV) | Method | Reference |
---|---|---|
9.6 ± 0.02 | EI | Olivares, Flesch, et al., 1984 |
Appearance energy determinations
Ion | AE (eV) | Other Products | Method | Reference | Comment |
---|---|---|---|---|---|
C3H4O+ | 10.0 ± 0.04 | CO | EI | Olivares, Flesch, et al., 1984 |

Van Den Dool and Kratz RI, non-polar column, custom temperature program

Column type | Active phase | I | Reference | Comment |
---|---|---|---|---|
Capillary | VF-5MS | 709.2 | Tret'yakov, 2007 | 30. m/0.25 mm/0.25 μm, He; Program: Multi-step temperature program; T(initial)=60C; T(final)=270C |

References

Mansson, Nakase, et al., 1968
Mansson, M.; Nakase, Y.; Sunner, S.,
The enthalpies of combustion and formation of diketene,
Acta Chem. Scand., 1968, 22, 171-174. [all data]
Thermodynamics Research Center, 1997
Thermodynamics Research Center,
Selected Values of Properties of Chemical Compounds., Thermodynamics Research Center, Texas A&M University, College Station, Texas, 1997. [all data]
Joshi R.M., 1970
Joshi R.M.,
Thermodynamic properties of some monomeric compounds in the standard ideal gas state,
J. Polym. Sci., Part A-2, 1970, 8, 679-687. [all data]
Dorofeeva O.V., 1997
Dorofeeva O.V.,
Unpublished results. Thermocenter of Russian Academy of Science, Moscow, 1997. [all data]
Weast and Grasselli, 1989
CRC Handbook of Data on Organic Compounds, 2nd Editon, Weast,R.C and Grasselli, J.G., ed(s)., CRC Press, Inc., Boca Raton, FL, 1989, 1. [all data]
Majer and Svoboda, 1985
Majer, V.; Svoboda, V.,
Enthalpies of Vaporization of Organic Compounds: A Critical Review and Data Compilation, Blackwell Scientific Publications, Oxford, 1985, 300. [all data]
Aldrich Chemical Company Inc., 1990
Aldrich Chemical Company Inc.,
Catalog Handbook of Fine Chemicals, Aldrich Chemical Company, Inc., Milwaukee WI, 1990, 1. [all data]
Stephenson and Malanowski, 1987
Stephenson, Richard M.; Malanowski, Stanislaw,
Handbook of the Thermodynamics of Organic Compounds, 1987, https://doi.org/10.1007/978-94-009-3173-2
. [all data]
Lopatin, Popov, et al., 1992
Lopatin, E.B.; Popov, V.V.; Epshtein, N.A.; Mikhaleva, L.M.; Makarov, Yu.N.,
Kinetic and thermochemical characteristics of diketene-based reactions,
Khim.-Farm. Zh., 1992, 26, 76-78. [all data]
Olivares, Flesch, et al., 1984
Olivares, J.A.; Flesch, G.D.; Svec, H.J.,
Mass spectrometry of five ketene dimers,
Int. J. Mass Spectrom. Ion Processes, 1984, 56, 293. [all data]