Cyclopropylacetylene
- Formula: C5H6
- Molecular weight: 66.1011
- IUPAC Standard InChIKey: NPTDXPDGUHAFKC-UHFFFAOYSA-N
- CAS Registry Number: 6746-94-7
- Chemical structure:
View 3d structure (requires JavaScript / HTML 5) - Other names: Cyclopropane,ethynyl-; Cyclopropylacethylene; ethynyl cyclopropane

Gas phase thermochemistry data

Data compiled by: Hussein Y. Afeefy, Joel F. Liebman, and Stephen E. Stein
Quantity | Value | Units | Method | Reference | Comment |
---|---|---|---|---|---|
ΔfH°gas | 292.0 ± 1.6 | kJ/mol | Ccb | Lebedeva, Gutner, et al., 1977 |

Condensed phase thermochemistry data

Data compiled by: Hussein Y. Afeefy, Joel F. Liebman, and Stephen E. Stein
Quantity | Value | Units | Method | Reference | Comment |
---|---|---|---|---|---|
ΔfH°liquid | 261.1 ± 0.8 | kJ/mol | Ccb | Lebedeva, Gutner, et al., 1977 | |
Quantity | Value | Units | Method | Reference | Comment |
ΔcH°liquid | -3086.1 ± 0.8 | kJ/mol | Ccb | Lebedeva, Gutner, et al., 1977 | Corresponding ΔfHºliquid = 261.1 kJ/mol (simple calculation by NIST; no Washburn corrections) |

Phase change data

Data compiled as indicated in comments:
ALS - Hussein Y. Afeefy, Joel F. Liebman, and Stephen E. Stein
DRB - Donald R. Burgess, Jr.
AC - William E. Acree, Jr., James S. Chickos
Quantity | Value | Units | Method | Reference | Comment |
---|---|---|---|---|---|
ΔvapH° | 30.9 ± 1.5 | kJ/mol | V | Lebedeva, Gutner, et al., 1977 | ALS |
ΔvapH° | 30.9 | kJ/mol | N/A | Lebedeva, Gutner, et al., 1977 | DRB |
Enthalpy of vaporization
ΔvapH (kJ/mol) | Temperature (K) | Method | Reference | Comment |
---|---|---|---|---|
31.1 | 305. | A | Stephenson and Malanowski, 1987 | Based on data from 290. to 320. K.; AC |

Gas phase ion energetics data

Data compiled as indicated in comments:
LLK - Sharon G. Lias, Rhoda D. Levin, and Sherif A. Kafafi
Ionization energy determinations
IE (eV) | Method | Reference | Comment |
---|---|---|---|
8.7 | PE | Bruckmann and Klessinger, 1973 | LLK |
9.58 | PE | Bruckmann and Klessinger, 1973 | Vertical value; LLK |

References

Lebedeva, Gutner, et al., 1977
Lebedeva, N.D.; Gutner, N.M.; Nazarova, L.F.,
Enthalpies of burning and the formation of some substituted derivatives of cyclopropane,
Termodin. Org. Soedin., 1977, 26-29. [all data]
Stephenson and Malanowski, 1987
Stephenson, Richard M.; Malanowski, Stanislaw,
Handbook of the Thermodynamics of Organic Compounds, 1987, https://doi.org/10.1007/978-94-009-3173-2
. [all data]
Bruckmann and Klessinger, 1973
Bruckmann, P.; Klessinger, M.,
Photoelektronenspektren organischer verbindungen. III. Photoelektronenspektren acetylensubstituierter kleiner ringe,
J. Electron Spectrosc. Relat. Phenom., 1973, 2, 341. [all data]