1-Propyne, 1-chloro-3,3,3-trifluoro-
- Formula: C3ClF3
- Molecular weight: 128.480
- IUPAC Standard InChIKey: ZDFRNVBDGBEAAO-UHFFFAOYSA-N
- CAS Registry Number: 673-93-8
- Chemical structure:
View 3d structure (requires JavaScript / HTML 5) - Permanent link for this species. Use this link for bookmarking this species for future reference.

Gas phase ion energetics data

Data compiled by: Sharon G. Lias, Rhoda D. Levin, and Sherif A. Kafafi
Ionization energy determinations
IE (eV) | Method | Reference |
---|---|---|
11.14 ± 0.02 | PE | Bieri, Heilbronner, et al., 1979 |

Vibrational and/or electronic energy levels

Data compiled by: Takehiko Shimanouchi
Symmetry: C3ν Symmetry Number σ = 3
Sym. | No | Approximate | Selected Freq. | Infrared | Raman | Comments | ||||
---|---|---|---|---|---|---|---|---|---|---|
Species | type of mode | Value | Rating | Value | Phase | Value | Phase | |||
a1 | 1 | C≡C str | 2270 | C | 2270 VS | gas | 2266 S p | liq. | ||
a1 | 2 | CF3 s-str | 1276 | C | 1276 VS | gas | 1272 W | liq. | ||
a1 | 3 | C-C str | 937 | C | 937 S | gas | 933 S p | liq. | ||
a1 | 4 | CCl str | 723 | C | 723 S | gas | 723 S p | liq. | ||
a1 | 5 | CF3 s-deform | 377 | C | 377 W | gas | 374 S p | liq. | ||
e | 6 | CF3 d-str | 1174 | C | 1174 VS | gas | 1153 W b | liq. | ||
e | 7 | CF3 d-deform | 606 | C | 606 M | gas | 603 W | liq. | ||
e | 8 | CF3 rock | 448 | D | 448 M dp | liq. | ||||
e | 9 | CCCCl deform | 311 | C | 311 W | gas | 316 VS dp | liq. | ||
e | 10 | CCCCl deform | 97 | D | 97 VS dp | liq. | ||||
Source: Shimanouchi, 1972

References

Bieri, Heilbronner, et al., 1979
Bieri, G.; Heilbronner, E.; Hornung, V.; Kloster-Jensen, E.; Maier, J.P.; Thommen, F.; von Niessen, W.,
Electronic states of substituted haloacetylene and cyanoacetylene radical cations,
Chem. Phys., 1979, 36, 1. [all data]
Shimanouchi, 1972
Shimanouchi, T.,
Tables of Molecular Vibrational Frequencies Consolidated Volume II,
J. Phys. Chem. Ref. Data, 1972, 6, 3, 993-1102. [all data]