1,3,5,2,4,6-Triazatriphosphorine,2,4,6-tribromo-2,4,6-trifluoro-2,2,4,4,6,6-hexahydro-
- Formula: Br3F3N3P3
- Molecular weight: 431.649
- IUPAC Standard InChIKey: MNEGSJVBZNLCQQ-UHFFFAOYSA-N
- CAS Registry Number: 67336-18-9
- Chemical structure:
View 3d structure (requires JavaScript / HTML 5) - Permanent link for this species. Use this link for bookmarking this species for future reference.

Gas phase ion energetics data

Data compiled as indicated in comments:
LLK - Sharon G. Lias, Rhoda D. Levin, and Sherif A. Kafafi
Ionization energy determinations
IE (eV) | Method | Reference | Comment |
---|---|---|---|
10.37 ± 0.03 | EI | Clare and Sowerby, 1981 | LLK |
Appearance energy determinations
Ion | AE (eV) | Other Products | Method | Reference | Comment |
---|---|---|---|---|---|
Br2F3N3P3+ | 11.24 | Br | EI | Clare and Sowerby, 1981 | LLK |
Br3F2N3P3+ | 11.05 | F | EI | Clare and Sowerby, 1981 | LLK |

References

Clare and Sowerby, 1981
Clare, P.; Sowerby, D.B.,
Electron impact ionisation energies of some halo-cyclotriphosphazenes,
J. Inorg. Nucl. Chem., 1981, 43, 477. [all data]