Benzene, 1-propynyl-
- Formula: C9H8
- Molecular weight: 116.1598
- IUPAC Standard InChIKey: GHUURDQYRGVEHX-UHFFFAOYSA-N
- CAS Registry Number: 673-32-5
- Chemical structure:
View 3d structure (requires JavaScript / HTML 5) - Other names: Methylphenylacetylene; Phenylmethylacetylene; 1-Methyl-2-phenylacetylene; 1-Phenyl-1-propyne; 1-Phenylpropyne; 1-Propynylbenzene; 1-Phenylpropyne-1; Methylphenylethyne; Propyne, 1-phenyl-; prop-1-ynylbenzene

Gas phase thermochemistry data

Data compiled by: Hussein Y. Afeefy, Joel F. Liebman, and Stephen E. Stein
Quantity | Value | Units | Method | Reference | Comment |
---|---|---|---|---|---|
ΔfH°gas | 268.2 ± 2.2 | kJ/mol | Chyd | Davis, Allinger, et al., 1985 |

Phase change data

Data compiled by: Robert L. Brown and Stephen E. Stein
Quantity | Value | Units | Method | Reference | Comment |
---|---|---|---|---|---|
Tboil | 458.2 | K | N/A | Aldrich Chemical Company Inc., 1990 | |
Tboil | 456. | K | N/A | Farchan Laboratories, 1990 |
Reduced pressure boiling point
Tboil (K) | Pressure (bar) | Reference |
---|---|---|
363. | 0.027 | Farchan Laboratories, 1990 |

Reaction thermochemistry data

Data compiled by: Hussein Y. Afeefy, Joel F. Liebman, and Stephen E. Stein
Individual Reactions
By formula: 2H2 + C9H8 = C9H12
Quantity | Value | Units | Method | Reference | Comment |
---|---|---|---|---|---|
ΔrH° | -260.2 ± 2.0 | kJ/mol | Chyd | Davis, Allinger, et al., 1985 | liquid phase; solvent: Hexane |

Gas phase ion energetics data

Data compiled as indicated in comments:
LLK - Sharon G. Lias, Rhoda D. Levin, and Sherif A. Kafafi
Ionization energy determinations
IE (eV) | Method | Reference | Comment |
---|---|---|---|
8.42 ± 0.08 | PE | Elbel, Lienert, et al., 1981 | LLK |
8.41 ± 0.02 | PE | Carlier and Mouvier, 1979 | Vertical value; LLK |
8.49 | PE | Griebel, Hohlneicher, et al., 1974 | Vertical value; LLK |
Appearance energy determinations
Ion | AE (eV) | Other Products | Method | Reference | Comment |
---|---|---|---|---|---|
C9H7+ | 11.42 ± 0.05 | ? | EI | Schwarz and Bohlmann, 1973 | LLK |

Van Den Dool and Kratz RI, non-polar column, temperature ramp

View large format table.

Column type Active phase I Reference Comment
CapillaryPetrocol DH1038.White, Hackett, et al., 1992100. m/0.25 mm/0.5 μm, He, 1. K/min; Tstart: 30. C; Tend: 220. C

Normal alkane RI, non-polar column, custom temperature program

View large format table.

Column type Active phase I Reference Comment
CapillaryDB-5 MS1058.Luo and Agnew, 200130. m/0.25 mm/1.0 μm, Helium; Program: not specified
CapillaryMethyl Silicone1035.Zenkevich, 1995Program: not specified

Lee's RI, non-polar column, temperature ramp

View large format table.

Column type Active phase I Reference Comment
CapillaryHP-5149.7Shao, Wang, et al., 200630. m/0.3 mm/0.25 μm, He, 50. C @ 5. min, 5. K/min, 200. C @ 15. min

Lee's RI, non-polar column, custom temperature program

View large format table.

Column type Active phase I Reference Comment
CapillaryDB-5167.6Fuentes, Font, et al., 2007Column length: 60. m; Program: not specified
CapillaryDB-5MS153.3Aracil, Font, et al., 2005Column length: 60. m; Column diameter: 0.25 mm; Program: not specified

References

Davis, Allinger, et al., 1985
Davis, H.E.; Allinger, N.L.; Rogers, D.W.,
Enthalpies of hydrogenation of phenylalkynes: indirect determination of the enthalpy of formation of diphenylcyclopropenone,
J. Org. Chem., 1985, 50, 3601-3604. [all data]
Aldrich Chemical Company Inc., 1990
Aldrich Chemical Company Inc.,
Catalog Handbook of Fine Chemicals, Aldrich Chemical Company, Inc., Milwaukee WI, 1990, 1. [all data]
Farchan Laboratories, 1990
Farchan Laboratories,
Research Chemicals Catalog, Farchan Laboratories, Gainesville, FL, 1990, 91. [all data]
Elbel, Lienert, et al., 1981
Elbel, S.; Lienert, K.; Krebs, A.; tom Dieck, H.,
Phenylethin - mustersonde fur substituenteneffekte,
Liebigs Ann. Chem., 1981, 1785. [all data]
Carlier and Mouvier, 1979
Carlier, P.; Mouvier, G.,
Etude par spectrometrie de photoelectrons de la structure electronique des phenyl-alcynes conjugues,
J. Electron Spectrosc. Relat. Phenom., 1979, 16, 169-181. [all data]
Griebel, Hohlneicher, et al., 1974
Griebel, R.; Hohlneicher, G.; Dorr, F.,
A photoelectron spectroscopic study of benzonitrile, ethynylbenzene and some of its substituted derivatives,
J. Electron Spectrosc. Relat. Phenom., 1974, 4, 185. [all data]
Schwarz and Bohlmann, 1973
Schwarz, H.; Bohlmann, F.,
Elektronenstossinduzierte fragmentierung von acetylenverbindungen. VI. Struktur und bildungsenthalpie der ionen [C11H9]+ und [C9H7]+,
Org. Mass Spectrom., 1973, 7, 395. [all data]