Bicyclo[2.2.0]hex-2-ene,5-methylene
- Formula: C7H8
- Molecular weight: 92.1384
- IUPAC Standard InChIKey: QPKRDQSHPVHXQQ-UHFFFAOYSA-N
- CAS Registry Number: 67254-49-3
- Chemical structure:
View 3d structure (requires JavaScript / HTML 5) - Permanent link for this species. Use this link for bookmarking this species for future reference.

Gas phase ion energetics data

Data compiled as indicated in comments:
LBLHLM - Sharon G. Lias, John E. Bartmess, Joel F. Liebman, John L. Holmes, Rhoda D. Levin, and W. Gary Mallard
Ionization energy determinations
IE (eV) | Method | Reference | Comment |
---|---|---|---|
8.8 | EI | Bally, Hasselmann, et al., 1985 | LBLHLM |
9.2 | EI | Bally, Hasselmann, et al., 1985 | Vertical value; LBLHLM |

References

Bally, Hasselmann, et al., 1985
Bally, T.; Hasselmann, D.; Loosen, K.,
41. The molecular ion of 5-methylene-1,3-cyclohexadiene: Electronic absorption spectrum and revised enthalpy of formation,
Helv. Chim. Acta, 1985, 68, 345. [all data]