Iron,bis[μ-(carbonothioyl)]dicarbonylbis(η5-2,4-cyclopentadien-1-yl)di-(fe-fe)-

Gas phase ion energetics data

Data compiled by: Sharon G. Lias, Rhoda D. Levin, and Sherif A. Kafafi

Ionization energy determinations

IE (eV) Method Reference
6.76 ± 0.04EIEfraty, Liebman, et al., 1978

Appearance energy determinations

Ion AE (eV) Other Products MethodReferenceComment
CSFe+12.02 ± 0.06?EIEfraty, Liebman, et al., 1978
CSFe2+20.00 ± 0.03?EIEfraty, Liebman, et al., 1978
C2S2Fe2+22.53 ± 0.03?EIEfraty, Liebman, et al., 1978
C5H5Fe+15.32 ± 0.03?EIEfraty, Liebman, et al., 1978
C6O6S2Fe2+13.83 ± 0.11?EIEfraty, Liebman, et al., 1978
C6H5SFe+14.74 ± 0.09?EIEfraty, Liebman, et al., 1978
C6H5SFe2+17.19 ± 0.02?EIEfraty, Liebman, et al., 1978
C7H5S2Fe2+13.23 ± 0.02?EIEfraty, Liebman, et al., 1978
C10H10Fe+8.62 ± 0.03?EIEfraty, Liebman, et al., 1978
C11H10SFe2+12.61 ± 0.042CO+CSEIEfraty, Liebman, et al., 1978
C12H10S2Fe2+8.89 ± 0.032COEIEfraty, Liebman, et al., 1978
C13H10OS2Fe2+7.47 ± 0.02COEIEfraty, Liebman, et al., 1978
Fe+20.21 ± 0.03?EIEfraty, Liebman, et al., 1978
Fe2+20.89 ± 0.03?EIEfraty, Liebman, et al., 1978

References

Efraty, Liebman, et al., 1978
Efraty, A.; Liebman, D.; Huang, M.H.A.; Weston, C.A.; Angelici, R.J., Mass spectra of organometallic compounds. 7. Electron-impact study of some cyclopentadienylmetal thiocarbonyl-bridged dimers, Inorg. Chem., 1978, 17, 2831. [all data]