Piperidine, 1,2-dimethyl-
- Formula: C7H15N
- Molecular weight: 113.2007
- IUPAC Standard InChIKey: MWUISCCBFHLWLY-UHFFFAOYSA-N
- CAS Registry Number: 671-36-3
- Chemical structure:
View 3d structure (requires JavaScript / HTML 5) - Other names: 1,2-Dimethylpiperidine

Phase change data

Data compiled by: Thermodynamics Research Center, NIST Boulder Laboratories, Chris Muzny director
Quantity | Value | Units | Method | Reference | Comment |
---|---|---|---|---|---|
Tboil | 401. | K | N/A | Terry, Kepner, et al., 1960 | Uncertainty assigned by TRC = 1. K |

Gas phase ion energetics data

Data compiled as indicated in comments:
LBLHLM - Sharon G. Lias, John E. Bartmess, Joel F. Liebman, John L. Holmes, Rhoda D. Levin, and W. Gary Mallard
Ionization energy determinations
IE (eV) | Method | Reference | Comment |
---|---|---|---|
7.63 ± 0.05 | PE | Rozeboom and Houk, 1982 | LBLHLM |

Kovats' RI, non-polar column, isothermal

Column type | Active phase | Temperature (C) | I | Reference | Comment |
---|---|---|---|---|---|
Capillary | OV-101 | 110. | 841. | Zhuravleva, Golovnya, et al., 1993 | 50. m/0.30 mm/0.40 μm, He |

Kovats' RI, polar column, isothermal

Column type | Active phase | Temperature (C) | I | Reference | Comment |
---|---|---|---|---|---|
Capillary | PEG-40M | 110. | 1000. | Zhuravleva, Golovnya, et al., 1993 | 50. m/0.30 mm/0.40 μm, He |

Normal alkane RI, non-polar column, custom temperature program

Column type | Active phase | I | Reference | Comment |
---|---|---|---|---|
Capillary | Methyl Silicone | 834. | Farkas, Héberger, et al., 2004 | Program: not specified |

References

Terry, Kepner, et al., 1960
Terry, T.D.; Kepner, R.E.; Dinsmore, W.,
Binary Systems Containing Isoamyl Alcohol or Active Amyl Alcohol,
J. Chem. Eng. Data, 1960, 5, 403. [all data]
Rozeboom and Houk, 1982
Rozeboom, M.D.; Houk, K.N.,
Stereospecific alkyl group effects on amine lone-pair ionization potentials: Photoelectron spectra of alkylpiperidines,
J. Am. Chem. Soc., 1982, 104, 1189. [all data]
Zhuravleva, Golovnya, et al., 1993
Zhuravleva, I.L.; Golovnya, R.V.; Kuzmenko, T.E.,
The regularities of the gas-chromatographic behavior of methyl-substituted N-alkylpiperidines,
Russ. Chem. Bull. (Engl. Transl.), 1993, 42, 10, 1677-1679, https://doi.org/10.1007/BF00697038
. [all data]
Farkas, Héberger, et al., 2004
Farkas, O.; Héberger, K.; Zenkevich, I.G.,
Quantitative structure-retention relationships. XIV. Prediction of gas chromatographic retention indices for saturated O-, N-, and S-heterocyclic compounds,
Chemom. Intell. Lab. Syst., 2004, 72, 2, 173-184, https://doi.org/10.1016/j.chemolab.2004.01.012
. [all data]