Benzyl cation
- Formula: C7H7+
- Molecular weight: 91.1299
- IUPAC Standard InChIKey: URXQGZXYWAWBIG-UHFFFAOYSA-N
- CAS Registry Number: 6711-19-9
- Chemical structure:
View 3d structure (requires JavaScript / HTML 5) - Permanent link for this species. Use this link for bookmarking this species for future reference.

Gas phase ion energetics data

Data compiled by: Sharon G. Lias, Rhoda D. Levin, and Sherif A. Kafafi
Appearance energy determinations
Ion | AE (eV) | Other Products | Method | Reference | Comment |
---|---|---|---|---|---|
C5H5+ | 3.55 ± 0.22 | C2H2 | PI | McCrery and Freiser, 1978 |

Vibrational and/or electronic energy levels

Data compiled by: Marilyn E. Jacox

State:   X

Vib.
sym.
 No.   Approximate
 type of mode
 cm-1   Med.   Method   References

a1 11 993 ± 2 gas TPE Eiden, Lu, et al., 1996
12 820 ± 2 gas TPE Eiden, Lu, et al., 1996
13 Ring deform. 525 ± 2 gas PE TPE Houle and Beauchamp, 1978
Eiden, Weinhold, et al., 1991
Eiden, Lu, et al., 1996
a2 16 627 T gas TPE Eiden, Lu, et al., 1996
17 316 H gas TPE Eiden, Lu, et al., 1996
b1 23 400 H gas TPE Eiden, Lu, et al., 1996
24 163 H gas TPE Eiden, Lu, et al., 1996
b2 28 1547 ± 2 gas TPE Eiden, Lu, et al., 1996
32 1183 T gas TPE Eiden, Lu, et al., 1996
33 1115 T gas TPE Eiden, Lu, et al., 1996
34 973 ± 2 gas TPE Eiden, Lu, et al., 1996
35 Ring deform. 598 ± 2 gas TPE Eiden, Weinhold, et al., 1991
Eiden, Lu, et al., 1996
b1 36 353 ± 2 gas TPE Eiden, Lu, et al., 1996

Additional references: Jacox, 1994, page 392; Jacox, 1998, page 349

References

McCrery and Freiser, 1978
McCrery, D.A.; Freiser, B.S.,
Gas phase photodissociation of C7H7+,
J. Am. Chem. Soc., 1978, 100, 2902. [all data]