Morpholine, 4-(1-cyclohexen-1-yl)-
- Formula: C10H17NO
- Molecular weight: 167.2481
- IUPAC Standard InChIKey: IIQFBBQJYPGOHJ-UHFFFAOYSA-N
- CAS Registry Number: 670-80-4
- Chemical structure:
View 3d structure (requires JavaScript / HTML 5) - Other names: Cyclohexanone morpholine enamine; N-Morpholino-1-cyclohexene; 1(1-Cyclohexenyl)morpholine; 1-(N-Morpholino)cyclohexene; 1-Morpholin-1-ylcyclohexene; 1-Morpholino-1-cyclohexene; 1-Morpholinocyclohexene; 4-(1-Cyclohexen-1-yl)morpholine; 4-(1-Cyclohexenyl)morpholine; NSC 42450; 1-(4-Morpholino)cyclohexene; N-(cyclohex-1-en-1-yl)morpholine

Phase change data

Data compiled by: Robert L. Brown and Stephen E. Stein
Reduced pressure boiling point
Tboil (K) | Pressure (bar) | Reference |
---|---|---|
392.2 | 0.013 | Aldrich Chemical Company Inc., 1990 |

Gas phase ion energetics data

Data compiled by: Sharon G. Lias, Rhoda D. Levin, and Sherif A. Kafafi
Ionization energy determinations
IE (eV) | Method | Reference |
---|---|---|
7.67 ± 0.05 | PE | Domelsmith and Houk, 1977 |
7.67 ± 0.05 | PE | Colonna, Distefano, et al., 1975 |

Normal alkane RI, non-polar column, custom temperature program

Column type | Active phase | I | Reference | Comment |
---|---|---|---|---|
Capillary | Methyl Silicone | 1260. | Garkani-Nejad, Karlovits, et al., 2004 | Program: not specified |

References

Aldrich Chemical Company Inc., 1990
Aldrich Chemical Company Inc.,
Catalog Handbook of Fine Chemicals, Aldrich Chemical Company, Inc., Milwaukee WI, 1990, 1. [all data]
Domelsmith and Houk, 1977
Domelsmith, L.N.; Houk, K.N.,
Photoelectron spectra of cyclopentanone and cyclohexanone enamines,
Tetrahedron Lett., 1977, 23, 1981. [all data]
Colonna, Distefano, et al., 1975
Colonna, F.P.; Distefano, G.; Pignataro, S.; Pitacco, G.; Valentin, E.,
Ionization energies of some amines and enamines and an estimation of their relative basicity in gaseous phase,
J. Chem. Soc. Faraday Trans. 2, 1975, 71, 1572. [all data]
Garkani-Nejad, Karlovits, et al., 2004
Garkani-Nejad, Z.; Karlovits, M.; Demuth, W.; Stimpfl, T.; Vycudilik, W.; Jalali-Heravi, M.; Varmuza, K.,
Prediction of gas chromatographic retention indices of a diverse set of toxicologically relevant compounds,
J. Chromatogr. A, 2004, 1028, 2, 287-295, https://doi.org/10.1016/j.chroma.2003.12.003
. [all data]